{"text_format":"1","workbook":"xlsx","n_sheets":4,"sheets":["KSPS Dose-Response","Results","IC50","Kinase Strips"],"not_rendered":{"charts":4,"images":2,"macros":1,"external_links":0,"defined_names":409,"comments":1,"pivot_tables":0},"unopened":[],"bounds":{"document_bytes":16777216,"sheet_cells":100000,"rows_first":2000,"rows_last":500,"rows_between":2000,"halvings":0,"cell_chars":16384,"cell_head_chars":4096},"cells_cut":0,"cells_raw":0,"read":"whole","date_system":"1900"}

{"sheet":"KSPS Dose-Response","index":0,"n_rows":0,"n_cols":0,"rows_kept":0,"cut":false,"hidden":false,"merged":[]}

{"sheet":"Results","index":1,"n_rows":58,"n_cols":29,"rows_kept":58,"cut":false,"hidden":false,"merged":[[1,1,2,1],[2,3,2,13],[1,3,1,13]]}
[]
[null,null,null,"Kinase Selectivity Profiling Systems (KPS)"]
[null,null,null,"Dose-Response Data Analysis Workbook"]
[]
[]
["Luminescence"]
[null,"Emission Filter:",null,"None"]
[null,"Integration Time(s):",null,0.3]
[null,"Reading:",null,1,null,1,2,3,4,5,6,7,8,9,10,11,12,13,14,15,16,17,18,19,20,21,22,23,24]
[null,null,null,null,"A",33569,32851,30866,29803,33959,33012,33213,32638,30846,32598,31266,30629,29204,31457,33718,32622,32890,30177,33846,32425,32795,30112,734,486]
[null,null,null,null,"B",10872,32299,31905,30761,178,146,144,118,146,134,148,100,138,104,112,132,152,126,150,132,154,128,14,6]
[null,null,null,null,"C",878,900,1020,1066,2438,2712,5035,5244,7618,7908,9218,7334,8857,9336,10824,9889,12219,11433,13171,13145,13119,10935,526,526]
[null,null,null,null,"D",7045,7848,1818,2632,54,32,64,74,46,64,56,44,60,68,76,46,66,70,96,56,80,74,28,8]
[null,null,null,null,"E",12622,12796,11433,10626,13123,13241,14014,13249,12403,13503,13181,12553,12043,12325,13325,11782,12201,12415,12752,12357,13407,12391,556,526]
[null,null,null,null,"F",11700,12932,12852,12840,180,124,130,96,104,100,90,122,108,110,88,106,78,90,98,74,76,96,16,6]
[null,null,null,null,"G",25210,25043,23712,19877,22887,26575,25804,25011,25489,26653,24880,26418,25627,26266,28043,22191,26179,22935,22042,23323,22879,21165,1378,472]
[null,null,null,null,"H",15468,17328,26979,21517,186,166,164,136,134,110,122,122,150,134,162,88,132,126,130,104,100,96,38,14]
[null,null,null,null,"I",26513,25910,25633,25461,29817,29190,31716,30012,28772,30739,28658,29174,28041,28995,28967,24949,28220,24822,26780,27169,26679,24415,1312,574]
[null,null,null,null,"J",2634,3276,22909,27178,188,142,154,124,110,132,122,102,110,96,100,100,78,100,118,72,100,98,22,4]
[null,null,null,null,"K",14946,13746,14604,13259,16344,15502,17384,16530,15708,16957,16396,15977,15500,16771,17130,14507,16334,14850,16354,16025,15688,14602,1336,550]
[null,null,null,null,"L",13505,13449,14981,15424,194,152,176,140,152,122,128,148,116,132,134,130,138,152,144,130,108,116,30,10]
[null,null,null,null,"M",42323,39111,36006,34152,43986,42424,46306,44272,44052,45013,42251,44626,36223,43889,43986,41526,43215,38906,45192,45667,48183,44214,588,488]
[null,null,null,null,"N",36217,32116,39522,36346,272,208,218,218,214,166,200,178,144,168,130,170,172,172,184,186,166,150,8,6]
[null,null,null,null,"O",23694,23590,22213,19912,23855,23690,24385,25417,25669,25186,20263,21629,22745,23375,25200,21286,24734,19472,24479,24302,26416,24100,494,552]
[null,null,null,null,"P",18590,17946,24413,23698,162,108,106,78,86,64,64,70,68,68,64,72,66,64,54,54,54,58,10,4]
[]
[]
[]
[]
["Kit Analysis"]
[null,"Compound",null,"CHK2 Inhibitor",null,null,"IC50"]
[null,"Reaction Conc. (nM)",null,10000,null,"CHK1","N/C"]
[null,"Dilution Factor",null,4,null,"CHK2",36.062077050805968]
[null,"KPS",null,"CAMK-1",null,"MAPKAPK2","N/C"]
[null,null,null,null,null,"MARK1","N/C"]
[null,null,null,null,null,"MELK","N/C"]
[null,null,null,null,null,"PASK","N/C"]
[null,null,null,null,null,"PIM1","N/C"]
[null,null,null,null,null,"PKCmu (PKD1)","N/C"]
[]
[]
[]
[]
[]
[]
[]
[]
[]
[]
[null,"Compound",null,"Blank",null,null,"IC50"]
[null,"Reaction Conc. (nM)",null,10000,null,"AXL1","N/C"]
[null,"Dilution Factor",null,4,null,"EPHA1","N/C"]
[null,"KPS",null,"TK-3",null,"FAK","N/C"]
[null,null,null,null,null,"ITK","N/C"]
[null,null,null,null,null,"JAK3","N/C"]
[null,null,null,null,null,"PYK2","N/C"]
[null,null,null,null,null,"SYK","N/C"]
[null,null,null,null,null,"TRKA","N/C"]

{"sheet":"IC50","index":2,"n_rows":177,"n_cols":85,"rows_kept":177,"cut":false,"hidden":true,"merged":[]}
[null,1,2,3,4,5,6,7,8,9,10,11,12,13,14,15,16,17,18,19,20,21,22,23,24,null,null,1,2,3,4,5,6,7,8,9,10,11,12,13,14,15,16,17,18,19,20,21,22,null,null,1,2,3,4,5,6,7,8,9,10,11,12,13,14,15,16,17,18,19,20]
["A",{"$f":"Results!F10","v":33569},{"$f":"Results!G10","v":32851},{"$f":"Results!H10","v":30866},{"$f":"Results!I10","v":29803},{"$f":"Results!J10","v":33959},{"$f":"Results!K10","v":33012},{"$f":"Results!L10","v":33213},{"$f":"Results!M10","v":32638},{"$f":"Results!N10","v":30846},{"$f":"Results!O10","v":32598},{"$f":"Results!P10","v":31266},{"$f":"Results!Q10","v":30629},{"$f":"Results!R10","v":29204},{"$f":"Results!S10","v":31457},{"$f":"Results!T10","v":33718},{"$f":"Results!U10","v":32622},{"$f":"Results!V10","v":32890},{"$f":"Results!W10","v":30177},{"$f":"Results!X10","v":33846},{"$f":"Results!Y10","v":32425},{"$f":"Results!Z10","v":32795},{"$f":"Results!AA10","v":30112},{"$f":"Results!AB10","v":734},{"$f":"Results!AC10","v":486},null,null,{"$f":"B2-AVERAGE($X2:$Y2)","v":32959},{"$f":"C2-AVERAGE($X2:$Y2)","v":32241},30256,29193,33349,32402,32603,32028,30236,31988,30656,30019,28594,30847,33108,32012,32280,29567,33236,31815,32185,29502,null,null,{"$f":"AB2/(AVERAGE($AV2:$AW2))*100","v":106.85881952437303},{"$f":"AC2/(AVERAGE($AV2:$AW2))*100","v":104.53093844732277},98.095222656313325,94.648791479566199,108.12326746316079,105.05292849384797,105.70460550845398,103.84035534229254,98.03037917227293,103.71066837421175,99.392092337121269,97.326827370434614,92.706729132556291,100.01134760970707,107.34190348047402,103.78848055506023,104.65738324120156,95.861364631121631,107.75690177833255,103.14977223726231,null,null,{"$f":"STDEV(AZ2:BA2)","v":1.646060495378086},{"$f":"STDEV(BB2:BC2)","v":2.4369948559706254},{"$f":"STDEV(BD2:BE2)","v":2.171057505742406},{"$f":"STDEV(BF2:BG2)","v":1.3182239343209026},{"$f":"STDEV(BH2:BI2)","v":4.0165710137916619},{"$f":"STDEV(BJ2:BK2)","v":1.4603628628911429},{"$f":"STDEV(BL2:BM2)","v":5.1651452591738707},{"$f":"STDEV(BN2:BO2)","v":2.5126494469838261},{"$f":"STDEV(BP2:BQ2)","v":6.2197244066305863},{"$f":"STDEV(BR2:BS2)","v":3.2577325402956303}]
["B",{"$f":"Results!F11","v":10872},{"$f":"Results!G11","v":32299},{"$f":"Results!H11","v":31905},{"$f":"Results!I11","v":30761},{"$f":"Results!J11","v":178},{"$f":"Results!K11","v":146},{"$f":"Results!L11","v":144},{"$f":"Results!M11","v":118},{"$f":"Results!N11","v":146},{"$f":"Results!O11","v":134},{"$f":"Results!P11","v":148},{"$f":"Results!Q11","v":100},{"$f":"Results!R11","v":138},{"$f":"Results!S11","v":104},{"$f":"Results!T11","v":112},{"$f":"Results!U11","v":132},{"$f":"Results!V11","v":152},{"$f":"Results!W11","v":126},{"$f":"Results!X11","v":150},{"$f":"Results!Y11","v":132},{"$f":"Results!Z11","v":154},{"$f":"Results!AA11","v":128},{"$f":"Results!AB11","v":14},{"$f":"Results!AC11","v":6},null,null,{"$f":"B3-AVERAGE($X3:$Y3)","v":10862},32289,31895,30751,168,136,134,108,136,124,138,90,128,94,102,122,142,116,140,122,144,118,null,null,{"$f":"AB3/(AVERAGE($AV3:$AW3))*100","v":8291.6030534351157},24648.091603053435,24347.32824427481,23474.045801526718,128.24427480916029,103.81679389312977,102.29007633587786,82.44274809160305,103.81679389312977,94.656488549618317,105.34351145038168,68.702290076335885,97.70992366412213,71.755725190839698,77.862595419847324,93.129770992366417,108.3969465648855,88.549618320610691,106.87022900763358,93.129770992366417,null,null,11565.783969835227,617.50393715832865,17.272837403029968,14.034180389961909,6.4773140261363151,25.909256104545182,18.352389740719492,10.795523376893863,14.034180389962039,9.7159710392044634]
["C",{"$f":"Results!F12","v":878},{"$f":"Results!G12","v":900},{"$f":"Results!H12","v":1020},{"$f":"Results!I12","v":1066},{"$f":"Results!J12","v":2438},{"$f":"Results!K12","v":2712},{"$f":"Results!L12","v":5035},{"$f":"Results!M12","v":5244},{"$f":"Results!N12","v":7618},{"$f":"Results!O12","v":7908},{"$f":"Results!P12","v":9218},{"$f":"Results!Q12","v":7334},{"$f":"Results!R12","v":8857},{"$f":"Results!S12","v":9336},{"$f":"Results!T12","v":10824},{"$f":"Results!U12","v":9889},{"$f":"Results!V12","v":12219},{"$f":"Results!W12","v":11433},{"$f":"Results!X12","v":13171},{"$f":"Results!Y12","v":13145},{"$f":"Results!Z12","v":13119},{"$f":"Results!AA12","v":10935},{"$f":"Results!AB12","v":526},{"$f":"Results!AC12","v":526},null,null,352,374,494,540,1912,2186,4509,4718,7092,7382,8692,6808,8331,8810,10298,9363,11693,10907,12645,12619,12593,10409,null,null,3.0606034257890617,3.2518911399008781,4.2952786714198758,4.6952438918354922,16.62464133553604,19.007042865837754,39.205286496826361,41.022519780888615,61.664203112772796,64.185722980610379,75.576036866359445,59.194852621511174,72.437179375706464,76.60203460568647,89.54003999652204,81.410312146769854,101.6694200504304,94.835231718980964,109.94696113381445,109.72089383531866,null,null,0.13526083980613898,0.28281811959465447,1.6846122775855497,1.2849779781583197,1.7829837974445619,11.583246463398508,2.9449973757791201,5.7485856917609004,4.8325009130738756,0.15985371977089799]
["D",{"$f":"Results!F13","v":7045},{"$f":"Results!G13","v":7848},{"$f":"Results!H13","v":1818},{"$f":"Results!I13","v":2632},{"$f":"Results!J13","v":54},{"$f":"Results!K13","v":32},{"$f":"Results!L13","v":64},{"$f":"Results!M13","v":74},{"$f":"Results!N13","v":46},{"$f":"Results!O13","v":64},{"$f":"Results!P13","v":56},{"$f":"Results!Q13","v":44},{"$f":"Results!R13","v":60},{"$f":"Results!S13","v":68},{"$f":"Results!T13","v":76},{"$f":"Results!U13","v":46},{"$f":"Results!V13","v":66},{"$f":"Results!W13","v":70},{"$f":"Results!X13","v":96},{"$f":"Results!Y13","v":56},{"$f":"Results!Z13","v":80},{"$f":"Results!AA13","v":74},{"$f":"Results!AB13","v":28},{"$f":"Results!AC13","v":8},null,null,7027,7830,1800,2614,36,14,46,56,28,46,38,26,42,50,58,28,48,52,78,38,62,56,null,null,11910.169491525425,13271.186440677966,3050.8474576271187,4430.5084745762715,61.016949152542374,23.728813559322035,77.966101694915253,94.915254237288138,47.457627118644069,77.966101694915253,64.406779661016941,44.067796610169488,71.186440677966104,84.745762711864401,98.305084745762713,47.457627118644069,81.355932203389841,88.135593220338976,132.20338983050848,64.406779661016941,null,null,962.38431405558845,975.56766082347201,26.366693535769556,11.98486069807708,21.572749256538714,14.381832837692457,9.5878885584616551,35.954582094231235,4.7939442792308178,47.939442792308292]
["E",{"$f":"Results!F14","v":12622},{"$f":"Results!G14","v":12796},{"$f":"Results!H14","v":11433},{"$f":"Results!I14","v":10626},{"$f":"Results!J14","v":13123},{"$f":"Results!K14","v":13241},{"$f":"Results!L14","v":14014},{"$f":"Results!M14","v":13249},{"$f":"Results!N14","v":12403},{"$f":"Results!O14","v":13503},{"$f":"Results!P14","v":13181},{"$f":"Results!Q14","v":12553},{"$f":"Results!R14","v":12043},{"$f":"Results!S14","v":12325},{"$f":"Results!T14","v":13325},{"$f":"Results!U14","v":11782},{"$f":"Results!V14","v":12201},{"$f":"Results!W14","v":12415},{"$f":"Results!X14","v":12752},{"$f":"Results!Y14","v":12357},{"$f":"Results!Z14","v":13407},{"$f":"Results!AA14","v":12391},{"$f":"Results!AB14","v":556},{"$f":"Results!AC14","v":526},null,null,12081,12255,10892,10085,12582,12700,13473,12708,11862,12962,12640,12012,11502,11784,12784,11241,11660,11874,12211,11816,12866,11850,null,null,97.758536980093865,99.166531801262337,88.137239035442633,81.607056157954361,101.81259103414793,102.76743809677941,109.02249554944166,102.83217349085612,95.986405567243892,104.88752225279173,102.28192264120408,97.200194206182232,93.073312833791874,95.355235474995965,103.44715973458489,90.961320602039166,94.35183686680692,96.083508658358966,98.810487133840425,95.614177051302789,null,null,0.99560268592376711,4.6175365950602387,0.67517883298278025,4.377218705354502,6.2940399684835988,3.593324636552448,1.6135629737385295,8.8288215194274393,1.2244768665959089,2.2601325341372958]
["F",{"$f":"Results!F15","v":11700},{"$f":"Results!G15","v":12932},{"$f":"Results!H15","v":12852},{"$f":"Results!I15","v":12840},{"$f":"Results!J15","v":180},{"$f":"Results!K15","v":124},{"$f":"Results!L15","v":130},{"$f":"Results!M15","v":96},{"$f":"Results!N15","v":104},{"$f":"Results!O15","v":100},{"$f":"Results!P15","v":90},{"$f":"Results!Q15","v":122},{"$f":"Results!R15","v":108},{"$f":"Results!S15","v":110},{"$f":"Results!T15","v":88},{"$f":"Results!U15","v":106},{"$f":"Results!V15","v":78},{"$f":"Results!W15","v":90},{"$f":"Results!X15","v":98},{"$f":"Results!Y15","v":74},{"$f":"Results!Z15","v":76},{"$f":"Results!AA15","v":96},{"$f":"Results!AB15","v":16},{"$f":"Results!AC15","v":6},null,null,11689,12921,12841,12829,169,113,119,85,93,89,79,111,97,99,77,95,67,79,87,63,65,85,null,null,15585.333333333332,17228,17121.333333333332,17105.333333333336,225.33333333333334,150.66666666666666,158.66666666666666,113.33333333333333,124,118.66666666666667,105.33333333333333,148,129.33333333333331,132,102.66666666666666,126.66666666666666,89.333333333333329,105.33333333333333,115.99999999999999,84,null,null,1161.5407392291029,11.313708498982187,52.79730632859561,32.055507413790139,3.7712361663282499,30.169889330626095,1.88561808316414,16.970562748477139,11.313708498984761,22.627416997969441]
["G",{"$f":"Results!F16","v":25210},{"$f":"Results!G16","v":25043},{"$f":"Results!H16","v":23712},{"$f":"Results!I16","v":19877},{"$f":"Results!J16","v":22887},{"$f":"Results!K16","v":26575},{"$f":"Results!L16","v":25804},{"$f":"Results!M16","v":25011},{"$f":"Results!N16","v":25489},{"$f":"Results!O16","v":26653},{"$f":"Results!P16","v":24880},{"$f":"Results!Q16","v":26418},{"$f":"Results!R16","v":25627},{"$f":"Results!S16","v":26266},{"$f":"Results!T16","v":28043},{"$f":"Results!U16","v":22191},{"$f":"Results!V16","v":26179},{"$f":"Results!W16","v":22935},{"$f":"Results!X16","v":22042},{"$f":"Results!Y16","v":23323},{"$f":"Results!Z16","v":22879},{"$f":"Results!AA16","v":21165},{"$f":"Results!AB16","v":1378},{"$f":"Results!AC16","v":472},null,null,24285,24118,22787,18952,21962,25650,24879,24086,24564,25728,23955,25493,24702,25341,27118,21266,25254,22010,21117,22398,21954,20240,null,null,115.11115324453714,114.31957150305732,108.01061762335877,89.832677631890789,104.10010902023986,121.58126747878846,117.92671943878277,114.16789116936057,116.43361615395553,121.95098829217423,113.54694980328956,120.83708584158886,117.08773759302271,120.11660425652937,128.53960278712611,100.80106176233588,119.70422334929137,104.32762952078494,100.09480020856046,106.16675356685785,null,null,0.55973281726383517,12.853744635969141,12.361045689036294,2.6578929586241298,3.9013712532641667,5.1549046284538633,2.1417321570754337,19.614110458850398,10.872893767688113,4.2935193947005166]
["H",{"$f":"Results!F17","v":15468},{"$f":"Results!G17","v":17328},{"$f":"Results!H17","v":26979},{"$f":"Results!I17","v":21517},{"$f":"Results!J17","v":186},{"$f":"Results!K17","v":166},{"$f":"Results!L17","v":164},{"$f":"Results!M17","v":136},{"$f":"Results!N17","v":134},{"$f":"Results!O17","v":110},{"$f":"Results!P17","v":122},{"$f":"Results!Q17","v":122},{"$f":"Results!R17","v":150},{"$f":"Results!S17","v":134},{"$f":"Results!T17","v":162},{"$f":"Results!U17","v":88},{"$f":"Results!V17","v":132},{"$f":"Results!W17","v":126},{"$f":"Results!X17","v":130},{"$f":"Results!Y17","v":104},{"$f":"Results!Z17","v":100},{"$f":"Results!AA17","v":96},{"$f":"Results!AB17","v":38},{"$f":"Results!AC17","v":14},null,null,15442,17302,26953,21491,160,140,138,110,108,84,96,96,124,108,136,62,106,100,104,78,74,70,null,null,21447.222222222223,24030.555555555555,37434.722222222226,29848.611111111109,222.22222222222223,194.44444444444443,191.66666666666669,152.77777777777777,150,116.66666666666667,133.33333333333331,133.33333333333331,172.22222222222223,150,188.88888888888889,86.111111111111114,147.22222222222223,138.88888888888889,144.44444444444443,108.33333333333333,null,null,1826.6925180652468,5364.1906095012146,19.641855032959668,27.498597046143512,23.570226039551411,0,15.713484026367727,72.67486362195072,5.8925565098879025,25.534411542847455]
["I",{"$f":"Results!F18","v":26513},{"$f":"Results!G18","v":25910},{"$f":"Results!H18","v":25633},{"$f":"Results!I18","v":25461},{"$f":"Results!J18","v":29817},{"$f":"Results!K18","v":29190},{"$f":"Results!L18","v":31716},{"$f":"Results!M18","v":30012},{"$f":"Results!N18","v":28772},{"$f":"Results!O18","v":30739},{"$f":"Results!P18","v":28658},{"$f":"Results!Q18","v":29174},{"$f":"Results!R18","v":28041},{"$f":"Results!S18","v":28995},{"$f":"Results!T18","v":28967},{"$f":"Results!U18","v":24949},{"$f":"Results!V18","v":28220},{"$f":"Results!W18","v":24822},{"$f":"Results!X18","v":26780},{"$f":"Results!Y18","v":27169},{"$f":"Results!Z18","v":26679},{"$f":"Results!AA18","v":24415},{"$f":"Results!AB18","v":1312},{"$f":"Results!AC18","v":574},null,null,25570,24967,24690,24518,28874,28247,30773,29069,27829,29796,27715,28231,27098,28052,28024,24006,27277,23879,25837,26226,25736,23472,null,null,103.92619086327426,101.47536985855959,100.34953666070558,99.650463339294433,117.35490164200944,114.80653552267923,125.07315883596164,118.14745569826044,113.1076247764591,121.10225979515525,112.64428548203544,114.74150544626892,110.13656316046172,114.01398146642822,113.90017883271013,97.569500894163554,110.86408714030239,97.053324662656479,105.01138026337181,106.59242399609819,null,null,1.7329921519081701,0.49431948611642607,1.8019669639244389,4.8972116531534624,5.6530606348314842,1.4829584583492983,2.7417487776457681,11.547533111719829,9.7656838013001472,1.1179667447633186]
["J",{"$f":"Results!F19","v":2634},{"$f":"Results!G19","v":3276},{"$f":"Results!H19","v":22909},{"$f":"Results!I19","v":27178},{"$f":"Results!J19","v":188},{"$f":"Results!K19","v":142},{"$f":"Results!L19","v":154},{"$f":"Results!M19","v":124},{"$f":"Results!N19","v":110},{"$f":"Results!O19","v":132},{"$f":"Results!P19","v":122},{"$f":"Results!Q19","v":102},{"$f":"Results!R19","v":110},{"$f":"Results!S19","v":96},{"$f":"Results!T19","v":100},{"$f":"Results!U19","v":100},{"$f":"Results!V19","v":78},{"$f":"Results!W19","v":100},{"$f":"Results!X19","v":118},{"$f":"Results!Y19","v":72},{"$f":"Results!Z19","v":100},{"$f":"Results!AA19","v":98},{"$f":"Results!AB19","v":22},{"$f":"Results!AC19","v":4},null,null,2621,3263,22896,27165,175,129,141,111,97,119,109,89,97,83,87,87,65,87,105,59,87,85,null,null,3047.6744186046512,3794.1860465116279,26623.255813953489,31587.20930232558,203.48837209302326,150,163.95348837209303,129.06976744186048,112.79069767441861,138.37209302325581,126.74418604651163,103.48837209302326,112.79069767441861,96.511627906976756,101.16279069767442,101.16279069767442,75.581395348837205,101.16279069767442,122.09302325581395,68.604651162790702,null,null,527.86343432763454,3510.0451731225239,37.82199062160597,24.666515622786733,18.088778123376649,16.444343748524304,11.511040623967048,0,18.088778123376851,37.82199062160597]
["K",{"$f":"Results!F20","v":14946},{"$f":"Results!G20","v":13746},{"$f":"Results!H20","v":14604},{"$f":"Results!I20","v":13259},{"$f":"Results!J20","v":16344},{"$f":"Results!K20","v":15502},{"$f":"Results!L20","v":17384},{"$f":"Results!M20","v":16530},{"$f":"Results!N20","v":15708},{"$f":"Results!O20","v":16957},{"$f":"Results!P20","v":16396},{"$f":"Results!Q20","v":15977},{"$f":"Results!R20","v":15500},{"$f":"Results!S20","v":16771},{"$f":"Results!T20","v":17130},{"$f":"Results!U20","v":14507},{"$f":"Results!V20","v":16334},{"$f":"Results!W20","v":14850},{"$f":"Results!X20","v":16354},{"$f":"Results!Y20","v":16025},{"$f":"Results!Z20","v":15688},{"$f":"Results!AA20","v":14602},{"$f":"Results!AB20","v":1336},{"$f":"Results!AC20","v":550},null,null,14003,12803,13661,12316,15401,14559,16441,15587,14765,16014,15453,15034,14557,15828,16187,13564,15391,13907,15411,15082,14745,13659,null,null,98.598788902971407,90.149274750035204,96.190677369384588,86.72018025630193,108.44247289114209,102.51373046049852,115.76538515702013,109.75214758484722,103.96423039008592,112.75876637093367,108.808618504436,105.85832981270245,102.49964793691029,111.44909167722857,113.97690466131532,95.507674975355584,108.37206027320096,97.922827770736518,108.51288550908322,106.19631037881989,null,null,5.9747087552728964,6.6966527298683687,4.1922539766164801,4.252001064169197,6.2186760294465326,2.0861691403827791,6.3282123566265502,13.059717554234016,7.3887231606874835,1.638065983737311]
["L",{"$f":"Results!F21","v":13505},{"$f":"Results!G21","v":13449},{"$f":"Results!H21","v":14981},{"$f":"Results!I21","v":15424},{"$f":"Results!J21","v":194},{"$f":"Results!K21","v":152},{"$f":"Results!L21","v":176},{"$f":"Results!M21","v":140},{"$f":"Results!N21","v":152},{"$f":"Results!O21","v":122},{"$f":"Results!P21","v":128},{"$f":"Results!Q21","v":148},{"$f":"Results!R21","v":116},{"$f":"Results!S21","v":132},{"$f":"Results!T21","v":134},{"$f":"Results!U21","v":130},{"$f":"Results!V21","v":138},{"$f":"Results!W21","v":152},{"$f":"Results!X21","v":144},{"$f":"Results!Y21","v":130},{"$f":"Results!Z21","v":108},{"$f":"Results!AA21","v":116},{"$f":"Results!AB21","v":30},{"$f":"Results!AC21","v":10},null,null,13485,13429,14961,15404,174,132,156,120,132,102,108,128,96,112,{"$f":"P13-AVERAGE($X13:$Y13)","v":114},{"$f":"Q13-AVERAGE($X13:$Y13)","v":110},{"$f":"R13-AVERAGE($X13:$Y13)","v":118},{"$f":"S13-AVERAGE($X13:$Y13)","v":132},{"$f":"T13-AVERAGE($X13:$Y13)","v":124},{"$f":"U13-AVERAGE($X13:$Y13)","v":110},{"$f":"V13-AVERAGE($X13:$Y13)","v":88},{"$f":"W13-AVERAGE($X13:$Y13)","v":96},null,null,14657.608695652176,14596.739130434782,16261.956521739132,16743.478260869564,189.13043478260869,143.47826086956522,169.56521739130434,130.43478260869566,143.47826086956522,110.86956521739131,117.39130434782609,139.13043478260869,104.34782608695652,121.73913043478262,123.91304347826086,119.56521739130434,128.26086956521738,143.47826086956522,134.78260869565219,119.56521739130434,null,null,43.041282333095928,340.48728702786838,32.28096174982069,27.669395785560642,23.057829821300377,15.371886547533633,12.297509238026928,3.0743773095067244,10.760320583273561,10.760320583273561]
["M",{"$f":"Results!F22","v":42323},{"$f":"Results!G22","v":39111},{"$f":"Results!H22","v":36006},{"$f":"Results!I22","v":34152},{"$f":"Results!J22","v":43986},{"$f":"Results!K22","v":42424},{"$f":"Results!L22","v":46306},{"$f":"Results!M22","v":44272},{"$f":"Results!N22","v":44052},{"$f":"Results!O22","v":45013},{"$f":"Results!P22","v":42251},{"$f":"Results!Q22","v":44626},{"$f":"Results!R22","v":36223},{"$f":"Results!S22","v":43889},{"$f":"Results!T22","v":43986},{"$f":"Results!U22","v":41526},{"$f":"Results!V22","v":43215},{"$f":"Results!W22","v":38906},{"$f":"Results!X22","v":45192},{"$f":"Results!Y22","v":45667},{"$f":"Results!Z22","v":48183},{"$f":"Results!AA22","v":44214},{"$f":"Results!AB22","v":588},{"$f":"Results!AC22","v":488},null,null,41785,{"$f":"C14-AVERAGE($X14:$Y14)","v":38573},{"$f":"D14-AVERAGE($X14:$Y14)","v":35468},{"$f":"E14-AVERAGE($X14:$Y14)","v":33614},{"$f":"F14-AVERAGE($X14:$Y14)","v":43448},{"$f":"G14-AVERAGE($X14:$Y14)","v":41886},{"$f":"H14-AVERAGE($X14:$Y14)","v":45768},{"$f":"I14-AVERAGE($X14:$Y14)","v":43734},{"$f":"J14-AVERAGE($X14:$Y14)","v":43514},{"$f":"K14-AVERAGE($X14:$Y14)","v":44475},{"$f":"L14-AVERAGE($X14:$Y14)","v":41713},{"$f":"M14-AVERAGE($X14:$Y14)","v":44088},{"$f":"N14-AVERAGE($X14:$Y14)","v":35685},{"$f":"O14-AVERAGE($X14:$Y14)","v":43351},43448,40988,42677,38368,44654,45129,47645,43676,null,null,91.512357508130663,84.477830947974724,77.677642601373179,73.617240284271972,95.154455163653481,91.733555261111903,100.23543325193549,95.78081711763997,95.299000229958068,97.403663998423141,91.354671981252949,96.556104291455412,78.152889258768525,94.942017717721001,95.154455163653481,89.766866328664818,93.465905980004607,84.028865211725673,97.795687738855236,98.835974200895734,null,null,4.9741614331231423,2.8711380127678341,2.4189415188475492,3.1498892761433668,1.4882220227992871,3.6779680584269716,11.871706583537348,3.8096005994654147,6.6729955215839398,0.73559361168539827]
["N",{"$f":"Results!F23","v":36217},{"$f":"Results!G23","v":32116},{"$f":"Results!H23","v":39522},{"$f":"Results!I23","v":36346},{"$f":"Results!J23","v":272},{"$f":"Results!K23","v":208},{"$f":"Results!L23","v":218},{"$f":"Results!M23","v":218},{"$f":"Results!N23","v":214},{"$f":"Results!O23","v":166},{"$f":"Results!P23","v":200},{"$f":"Results!Q23","v":178},{"$f":"Results!R23","v":144},{"$f":"Results!S23","v":168},{"$f":"Results!T23","v":130},{"$f":"Results!U23","v":170},{"$f":"Results!V23","v":172},{"$f":"Results!W23","v":172},{"$f":"Results!X23","v":184},{"$f":"Results!Y23","v":186},{"$f":"Results!Z23","v":166},{"$f":"Results!AA23","v":150},{"$f":"Results!AB23","v":8},{"$f":"Results!AC23","v":6},null,null,36210,32109,39515,36339,265,201,211,211,207,159,193,171,137,161,123,163,165,165,177,179,159,143,null,null,23980.132450331126,21264.238410596026,26168.874172185428,24065.562913907284,175.49668874172187,133.11258278145695,139.73509933774835,139.73509933774835,137.08609271523179,{"$f":"AK15/(AVERAGE($AV15:$AW15))*100","v":105.29801324503312},{"$f":"AL15/(AVERAGE($AV15:$AW15))*100","v":127.81456953642385},{"$f":"AM15/(AVERAGE($AV15:$AW15))*100","v":113.24503311258279},{"$f":"AN15/(AVERAGE($AV15:$AW15))*100","v":90.728476821192046},{"$f":"AO15/(AVERAGE($AV15:$AW15))*100","v":106.62251655629137},{"$f":"AP15/(AVERAGE($AV15:$AW15))*100","v":81.456953642384107},{"$f":"AQ15/(AVERAGE($AV15:$AW15))*100","v":107.94701986754967},{"$f":"AR15/(AVERAGE($AV15:$AW15))*100","v":109.27152317880795},{"$f":"AS15/(AVERAGE($AV15:$AW15))*100","v":109.27152317880795},{"$f":"AT15/(AVERAGE($AV15:$AW15))*100","v":117.21854304635761},{"$f":"AU15/(AVERAGE($AV15:$AW15))*100","v":118.54304635761591},null,null,1920.4270924808159,1487.2656536744848,29.97008873903258,0,22.477566554274425,10.302218004042413,11.238783277137172,18.731305461895261,0,0.93656527309477855]
["O",{"$f":"Results!F24","v":23694},{"$f":"Results!G24","v":23590},{"$f":"Results!H24","v":22213},{"$f":"Results!I24","v":19912},{"$f":"Results!J24","v":23855},{"$f":"Results!K24","v":23690},{"$f":"Results!L24","v":24385},{"$f":"Results!M24","v":25417},{"$f":"Results!N24","v":25669},{"$f":"Results!O24","v":25186},{"$f":"Results!P24","v":20263},{"$f":"Results!Q24","v":21629},{"$f":"Results!R24","v":22745},{"$f":"Results!S24","v":23375},{"$f":"Results!T24","v":25200},{"$f":"Results!U24","v":21286},{"$f":"Results!V24","v":24734},{"$f":"Results!W24","v":19472},{"$f":"Results!X24","v":24479},{"$f":"Results!Y24","v":24302},{"$f":"Results!Z24","v":26416},{"$f":"Results!AA24","v":24100},{"$f":"Results!AB24","v":494},{"$f":"Results!AC24","v":552},null,null,23171,23067,21690,19389,23332,23167,23862,24894,25146,24663,19740,21106,22222,22852,24677,20763,24211,18949,23956,23779,25893,23577,null,null,93.676975945017176,{"$f":"AC16/(AVERAGE($AV16:$AW16))*100","v":93.256519102486351},{"$f":"AD16/(AVERAGE($AV16:$AW16))*100","v":87.689508793208006},{"$f":"AE16/(AVERAGE($AV16:$AW16))*100","v":78.386901152213468},{"$f":"AF16/(AVERAGE($AV16:$AW16))*100","v":94.327875480088935},{"$f":"AG16/(AVERAGE($AV16:$AW16))*100","v":93.66080452799676},{"$f":"AH16/(AVERAGE($AV16:$AW16))*100","v":96.470588235294116},{"$f":"AI16/(AVERAGE($AV16:$AW16))*100","v":100.64281382656155},{"$f":"AJ16/(AVERAGE($AV16:$AW16))*100","v":101.66161309884778},99.708914493632506,79.805942995755004,85.328481908227204,89.840307256923396,92.387305437638972,99.765514453203963,83.941782898726501,97.881544370325443,76.608045279967669,96.8506165352739,96.135031332120477,null,null,0.29730788454983093,6.5779369456650301,0.47169039375694333,2.9502090082252552,1.3807664253612342,3.9050247143756742,1.8009996852537835,11.189067885846562,15.042635466357872,0.50599514966653925]
["P",{"$f":"Results!F25","v":18590},{"$f":"Results!G25","v":17946},{"$f":"Results!H25","v":24413},{"$f":"Results!I25","v":23698},{"$f":"Results!J25","v":162},{"$f":"Results!K25","v":108},{"$f":"Results!L25","v":106},{"$f":"Results!M25","v":78},{"$f":"Results!N25","v":86},{"$f":"Results!O25","v":64},{"$f":"Results!P25","v":64},{"$f":"Results!Q25","v":70},{"$f":"Results!R25","v":68},{"$f":"Results!S25","v":68},{"$f":"Results!T25","v":64},{"$f":"Results!U25","v":72},{"$f":"Results!V25","v":66},{"$f":"Results!W25","v":64},{"$f":"Results!X25","v":54},{"$f":"Results!Y25","v":54},{"$f":"Results!Z25","v":54},{"$f":"Results!AA25","v":58},{"$f":"Results!AB25","v":10},{"$f":"Results!AC25","v":4},null,null,18583,17939,24406,23691,155,101,99,71,79,57,57,63,61,61,57,65,59,57,47,47,47,51,null,null,37924.489795918365,36610.204081632648,49808.163265306124,48348.979591836738,316.32653061224494,206.12244897959181,202.0408163265306,144.89795918367346,161.22448979591837,116.32653061224489,116.32653061224489,128.57142857142858,124.48979591836735,124.48979591836735,116.32653061224489,132.65306122448979,120.40816326530613,116.32653061224489,95.918367346938766,95.918367346938766,null,null,929.34034098803613,1031.7986705068997,77.926053436884956,40.40610178208825,31.747651400212376,8.6584503818761025,0,11.54460050916812,2.8861501272920376,0]
[]
["Starting Conc.",10000,null,null,null,null,null,null,null,null,null,null,null,null,null,null,null,null,null,null,null,null,null,null,null,null,null,"Starting Conc.",10000]
["Dilution",4,null,null,null,null,null,null,null,null,null,null,null,null,null,null,null,null,null,null,null,null,null,null,null,null,null,"Dilution",4]
["Set 1",{"$f":"B19","v":10000},{"$f":"B21/$B$20","v":2500},{"$f":"C21/$B$20","v":625},156.25,39.0625,9.765625,2.44140625,0.6103515625,0.152587890625,3.814697265625E-2,1,0,null,{"$f":"B21","v":10000},2500,625,156.25,39.0625,9.765625,2.44140625,0.6103515625,0.152587890625,3.814697265625E-2,1,null,null,"Set 2",{"$f":"AC19","v":10000},{"$f":"AC21/$AC$20","v":2500},625,156.25,39.0625,9.765625,2.44140625,0.6103515625,0.152587890625,3.814697265625E-2,1,0,null,{"$f":"AC21","v":10000},{"$f":"AD21","v":2500},{"$f":"AE21","v":625},{"$f":"AF21","v":156.25},{"$f":"AG21","v":39.0625},{"$f":"AH21","v":9.765625},{"$f":"AI21","v":2.44140625},{"$f":"AJ21","v":0.6103515625},{"$f":"AK21","v":0.152587890625},{"$f":"AL21","v":3.814697265625E-2},1]
["Kinase 1",{"$f":"AVERAGE(B2:C2)","v":33210},{"$f":"AVERAGE(D2:E2)","v":30334.5},{"$f":"AVERAGE(F2:G2)","v":33485.5},{"$f":"AVERAGE(H2:I2)","v":32925.5},{"$f":"AVERAGE(J2:K2)","v":31722},{"$f":"AVERAGE(L2:M2)","v":30947.5},{"$f":"AVERAGE(N2:O2)","v":30330.5},{"$f":"AVERAGE(P2:Q2)","v":33170},{"$f":"AVERAGE(R2:S2)","v":31533.5},{"$f":"AVERAGE(T2:U2)","v":33135.5},{"$f":"AVERAGE(V2:W2)","v":31453.5},{"$f":"AVERAGE(X2:Y2)","v":610},null,{"$f":"B22-$M22","v":32600},{"$f":"C22-$M22","v":29724.5},32875.5,32315.5,31112,30337.5,29720.5,32560,30923.5,32525.5,30843.5,null,null,"Kinase 1",{"$f":"AVERAGE(B3:C3)","v":21585.5},{"$f":"AVERAGE(D3:E3)","v":31333},{"$f":"AVERAGE(F3:G3)","v":162},{"$f":"AVERAGE(H3:I3)","v":131},{"$f":"AVERAGE(J3:K3)","v":140},{"$f":"AVERAGE(L3:M3)","v":124},{"$f":"AVERAGE(N3:O3)","v":121},{"$f":"AVERAGE(P3:Q3)","v":122},{"$f":"AVERAGE(R3:S3)","v":139},{"$f":"AVERAGE(T3:U3)","v":141},{"$f":"AVERAGE(V3:W3)","v":141},{"$f":"AVERAGE(X3:Y3)","v":10},null,{"$f":"AC22-$AN22","v":21575.5},31323,152,121,130,114,111,112,129,131,131]
["Kinase 2",{"$f":"AVERAGE(B4:C4)","v":889},{"$f":"AVERAGE(D4:E4)","v":1043},{"$f":"AVERAGE(F4:G4)","v":2575},{"$f":"AVERAGE(H4:I4)","v":5139.5},{"$f":"AVERAGE(J4:K4)","v":7763},{"$f":"AVERAGE(L4:M4)","v":8276},{"$f":"AVERAGE(N4:O4)","v":9096.5},{"$f":"AVERAGE(P4:Q4)","v":10356.5},{"$f":"AVERAGE(R4:S4)","v":11826},{"$f":"AVERAGE(T4:U4)","v":13158},{"$f":"AVERAGE(V4:W4)","v":12027},{"$f":"AVERAGE(X4:Y4)","v":526},null,{"$f":"B23-$M23","v":363},517,2049,4613.5,7237,7750,8570.5,9830.5,11300,12632,11501,null,null,"Kinase 2",{"$f":"AVERAGE(B5:C5)","v":7446.5},{"$f":"AVERAGE(D5:E5)","v":2225},{"$f":"AVERAGE(F5:G5)","v":43},{"$f":"AVERAGE(H5:I5)","v":69},{"$f":"AVERAGE(J5:K5)","v":55},{"$f":"AVERAGE(L5:M5)","v":50},{"$f":"AVERAGE(N5:O5)","v":64},{"$f":"AVERAGE(P5:Q5)","v":61},{"$f":"AVERAGE(R5:S5)","v":68},{"$f":"AVERAGE(T5:U5)","v":76},{"$f":"AVERAGE(V5:W5)","v":77},{"$f":"AVERAGE(X5:Y5)","v":18},null,7428.5,2207,25,51,37,32,46,43,50,58,59]
["Kinase 3",{"$f":"AVERAGE(B6:C6)","v":12709},{"$f":"AVERAGE(D6:E6)","v":11029.5},{"$f":"AVERAGE(F6:G6)","v":13182},{"$f":"AVERAGE(H6:I6)","v":13631.5},{"$f":"AVERAGE(J6:K6)","v":12953},{"$f":"AVERAGE(L6:M6)","v":12867},{"$f":"AVERAGE(N6:O6)","v":12184},{"$f":"AVERAGE(P6:Q6)","v":12553.5},{"$f":"AVERAGE(R6:S6)","v":12308},{"$f":"AVERAGE(T6:U6)","v":12554.5},{"$f":"AVERAGE(V6:W6)","v":12899},{"$f":"AVERAGE(X6:Y6)","v":541},null,{"$f":"B24-$M24","v":12168},10488.5,12641,13090.5,12412,12326,11643,12012.5,11767,12013.5,12358,null,null,"Kinase 3",{"$f":"AVERAGE(B7:C7)","v":12316},{"$f":"AVERAGE(D7:E7)","v":12846},{"$f":"AVERAGE(F7:G7)","v":152},{"$f":"AVERAGE(H7:I7)","v":113},{"$f":"AVERAGE(J7:K7)","v":102},{"$f":"AVERAGE(L7:M7)","v":106},{"$f":"AVERAGE(N7:O7)","v":109},{"$f":"AVERAGE(P7:Q7)","v":97},{"$f":"AVERAGE(R7:S7)","v":84},{"$f":"AVERAGE(T7:U7)","v":86},{"$f":"AVERAGE(V7:W7)","v":86},{"$f":"AVERAGE(X7:Y7)","v":11},null,12305,12835,141,102,91,95,98,86,73,75,75]
["Kinase 4",{"$f":"AVERAGE(B8:C8)","v":25126.5},{"$f":"AVERAGE(D8:E8)","v":21794.5},{"$f":"AVERAGE(F8:G8)","v":24731},{"$f":"AVERAGE(H8:I8)","v":25407.5},{"$f":"AVERAGE(J8:K8)","v":26071},{"$f":"AVERAGE(L8:M8)","v":25649},{"$f":"AVERAGE(N8:O8)","v":25946.5},{"$f":"AVERAGE(P8:Q8)","v":25117},{"$f":"AVERAGE(R8:S8)","v":24557},{"$f":"AVERAGE(T8:U8)","v":22682.5},{"$f":"AVERAGE(V8:W8)","v":22022},{"$f":"AVERAGE(X8:Y8)","v":925},null,24201.5,20869.5,23806,24482.5,25146,24724,25021.5,24192,23632,21757.5,21097,null,null,"Kinase 4",{"$f":"AVERAGE(B9:C9)","v":16398},{"$f":"AVERAGE(D9:E9)","v":24248},{"$f":"AVERAGE(F9:G9)","v":176},{"$f":"AVERAGE(H9:I9)","v":150},{"$f":"AVERAGE(J9:K9)","v":122},{"$f":"AVERAGE(L9:M9)","v":122},{"$f":"AVERAGE(N9:O9)","v":142},{"$f":"AVERAGE(P9:Q9)","v":125},{"$f":"AVERAGE(R9:S9)","v":129},{"$f":"AVERAGE(T9:U9)","v":117},{"$f":"AVERAGE(V9:W9)","v":98},{"$f":"AVERAGE(X9:Y9)","v":26},null,16372,24222,150,124,96,96,116,99,103,91,72]
["Kinase 5",{"$f":"AVERAGE(B10:C10)","v":26211.5},{"$f":"AVERAGE(D10:E10)","v":25547},{"$f":"AVERAGE(F10:G10)","v":29503.5},{"$f":"AVERAGE(H10:I10)","v":30864},{"$f":"AVERAGE(J10:K10)","v":29755.5},{"$f":"AVERAGE(L10:M10)","v":28916},{"$f":"AVERAGE(N10:O10)","v":28518},{"$f":"AVERAGE(P10:Q10)","v":26958},{"$f":"AVERAGE(R10:S10)","v":26521},{"$f":"AVERAGE(T10:U10)","v":26974.5},{"$f":"AVERAGE(V10:W10)","v":25547},{"$f":"AVERAGE(X10:Y10)","v":943},null,25268.5,24604,28560.5,29921,28812.5,27973,27575,26015,25578,26031.5,24604,null,null,"Kinase 5",{"$f":"AVERAGE(B11:C11)","v":2955},{"$f":"AVERAGE(D11:E11)","v":25043.5},{"$f":"AVERAGE(F11:G11)","v":165},{"$f":"AVERAGE(H11:I11)","v":139},{"$f":"AVERAGE(J11:K11)","v":121},{"$f":"AVERAGE(L11:M11)","v":112},{"$f":"AVERAGE(N11:O11)","v":103},{"$f":"AVERAGE(P11:Q11)","v":100},{"$f":"AVERAGE(R11:S11)","v":89},{"$f":"AVERAGE(T11:U11)","v":95},{"$f":"AVERAGE(V11:W11)","v":99},{"$f":"AVERAGE(X11:Y11)","v":13},null,2942,25030.5,152,126,108,99,90,87,76,82,86]
["Kinase 6",{"$f":"AVERAGE(B12:C12)","v":14346},{"$f":"AVERAGE(D12:E12)","v":13931.5},{"$f":"AVERAGE(F12:G12)","v":15923},{"$f":"AVERAGE(H12:I12)","v":16957},{"$f":"AVERAGE(J12:K12)","v":16332.5},{"$f":"AVERAGE(L12:M12)","v":16186.5},{"$f":"AVERAGE(N12:O12)","v":16135.5},{"$f":"AVERAGE(P12:Q12)","v":15818.5},{"$f":"AVERAGE(R12:S12)","v":15592},{"$f":"AVERAGE(T12:U12)","v":16189.5},{"$f":"AVERAGE(V12:W12)","v":15145},{"$f":"AVERAGE(X12:Y12)","v":943},null,13403,12988.5,14980,16014,15389.5,15243.5,15192.5,14875.5,14649,15246.5,14202,null,null,"Kinase 6",{"$f":"AVERAGE(B13:C13)","v":13477},{"$f":"AVERAGE(D13:E13)","v":15202.5},{"$f":"AVERAGE(F13:G13)","v":173},{"$f":"AVERAGE(H13:I13)","v":158},{"$f":"AVERAGE(J13:K13)","v":137},{"$f":"AVERAGE(L13:M13)","v":138},{"$f":"AVERAGE(N13:O13)","v":124},{"$f":"AVERAGE(P13:Q13)","v":132},{"$f":"AVERAGE(R13:S13)","v":145},{"$f":"AVERAGE(T13:U13)","v":137},{"$f":"AVERAGE(V13:W13)","v":112},{"$f":"AVERAGE(X13:Y13)","v":20},null,13457,15182.5,153,138,117,118,104,112,125,117,92]
["Kinase 7",{"$f":"AVERAGE(B14:C14)","v":40717},{"$f":"AVERAGE(D14:E14)","v":35079},{"$f":"AVERAGE(F14:G14)","v":43205},{"$f":"AVERAGE(H14:I14)","v":45289},{"$f":"AVERAGE(J14:K14)","v":44532.5},{"$f":"AVERAGE(L14:M14)","v":43438.5},{"$f":"AVERAGE(N14:O14)","v":40056},{"$f":"AVERAGE(P14:Q14)","v":42756},{"$f":"AVERAGE(R14:S14)","v":41060.5},{"$f":"AVERAGE(T14:U14)","v":45429.5},{"$f":"AVERAGE(V14:W14)","v":46198.5},{"$f":"AVERAGE(X14:Y14)","v":538},null,40179,34541,42667,44751,43994.5,42900.5,39518,42218,40522.5,44891.5,45660.5,null,null,"Kinase 7",{"$f":"AVERAGE(B15:C15)","v":34166.5},{"$f":"AVERAGE(D15:E15)","v":37934},{"$f":"AVERAGE(F15:G15)","v":240},{"$f":"AVERAGE(H15:I15)","v":218},{"$f":"AVERAGE(J15:K15)","v":190},{"$f":"AVERAGE(L15:M15)","v":189},{"$f":"AVERAGE(N15:O15)","v":156},{"$f":"AVERAGE(P15:Q15)","v":150},{"$f":"AVERAGE(R15:S15)","v":172},{"$f":"AVERAGE(T15:U15)","v":185},{"$f":"AVERAGE(V15:W15)","v":158},{"$f":"AVERAGE(X15:Y15)","v":7},null,34159.5,37927,233,211,183,182,149,143,165,178,151]
["Kinase 8",{"$f":"AVERAGE(B16:C16)","v":23642},{"$f":"AVERAGE(D16:E16)","v":21062.5},{"$f":"AVERAGE(F16:G16)","v":23772.5},{"$f":"AVERAGE(H16:I16)","v":24901},{"$f":"AVERAGE(J16:K16)","v":25427.5},{"$f":"AVERAGE(L16:M16)","v":20946},{"$f":"AVERAGE(N16:O16)","v":23060},{"$f":"AVERAGE(P16:Q16)","v":23243},{"$f":"AVERAGE(R16:S16)","v":22103},{"$f":"AVERAGE(T16:U16)","v":24390.5},{"$f":"AVERAGE(V16:W16)","v":25258},{"$f":"AVERAGE(X16:Y16)","v":523},null,23119,20539.5,23249.5,24378,24904.5,20423,22537,22720,21580,23867.5,24735,null,null,"Kinase 8",{"$f":"AVERAGE(B17:C17)","v":18268},{"$f":"AVERAGE(D17:E17)","v":24055.5},{"$f":"AVERAGE(F17:G17)","v":135},{"$f":"AVERAGE(H17:I17)","v":92},{"$f":"AVERAGE(J17:K17)","v":75},{"$f":"AVERAGE(L17:M17)","v":67},{"$f":"AVERAGE(N17:O17)","v":68},{"$f":"AVERAGE(P17:Q17)","v":68},{"$f":"AVERAGE(R17:S17)","v":65},{"$f":"AVERAGE(T17:U17)","v":54},{"$f":"AVERAGE(V17:W17)","v":56},{"$f":"AVERAGE(X17:Y17)","v":7},null,18261,24048.5,128,85,68,60,61,61,58,47,49]
[]
[]
[null,{"$f":"O21","v":10000},2500,625,156.25,39.0625,9.765625,2.44140625,0.6103515625,0.152587890625,3.814697265625E-2,null,null,null,null,null,null,null,null,null,null,null,null,null,null,null,null,null,{"$f":"AP21","v":10000},2500,625,156.25,39.0625,9.765625,2.44140625,0.6103515625,0.152587890625,3.814697265625E-2]
["Kinase 1",{"$f":"O22/$Y22*100","v":105.69487898584791},96.372007067939762,106.58809797850439,104.77248042537326,100.87052377324233,98.359459853777935,96.359038371131675,105.5651920177671,100.25937393616159,105.45333700779742,null,null,null,null,null,null,null,null,null,null,null,null,null,null,null,null,"Kinase 1",{"$f":"AP22/$AZ22*100","v":16469.847328244272},23910.687022900762,116.03053435114504,92.36641221374046,99.236641221374043,87.022900763358777,84.732824427480907,85.496183206106863,98.473282442748086,100]
["Kinase 2",3.1562472828449697,4.4952612816276849,17.815842100686897,40.113903138857495,62.924963046691595,67.385444743935309,74.51960699069646,85.475176071645947,98.252325884705684,109.83392748456654,null,null,null,null,null,null,null,null,null,null,null,null,null,null,null,null,"Kinase 2",12590.677966101695,3740.6779661016949,42.372881355932201,86.440677966101703,62.711864406779661,54.237288135593218,77.966101694915253,72.881355932203391,84.745762711864401,98.305084745762713]
["Kinase 3",98.462534390678101,84.872147596698497,102.29001456546368,105.92733452014889,100.43696391001779,99.741058423693147,94.21427415439392,97.204240168312026,95.217672762582936,97.212332092571614,null,null,null,null,null,null,null,null,null,null,null,null,null,null,null,null,"Kinase 3",16406.666666666668,17113.333333333332,188,136,121.33333333333334,126.66666666666666,130.66666666666666,114.66666666666667,97.333333333333343,100]
["Kinase 4",114.71536237379722,98.921647627624779,112.84068824951414,116.04730530407168,119.1923022230649,117.1920178224392,118.60217092477603,114.670332274731,112.01592643503815,103.13077688770915,null,null,null,null,null,null,null,null,null,null,null,null,null,null,null,null,"Kinase 4",22738.888888888887,33641.666666666672,208.33333333333334,172.22222222222223,133.33333333333331,133.33333333333331,161.11111111111111,137.5,143.05555555555557,126.38888888888889]
["Kinase 5",102.70078036091692,100,116.08071858234435,121.61030726711104,117.10494228580718,113.69289546415217,112.07527231344497,105.73483986343683,103.95870590147945,105.801902129735,null,null,null,null,null,null,null,null,null,null,null,null,null,null,null,null,"Kinase 5",3420.9302325581398,29105.232558139534,176.74418604651163,146.51162790697674,125.58139534883721,115.11627906976744,104.65116279069768,101.16279069767442,88.372093023255815,95.348837209302332]
["Kinase 6",94.374031826503312,91.455428812843266,105.4781016758203,112.75876637093367,108.36149838050979,107.33347415856922,106.97436980706942,104.74228981833545,103.14744402196874,107.35459794395155,null,null,null,null,null,null,null,null,null,null,null,null,null,null,null,null,"Kinase 6",14627.173913043478,16502.717391304348,166.30434782608697,150,127.17391304347827,128.26086956521738,113.04347826086956,121.73913043478262,135.86956521739131,127.17391304347827]
["Kinase 7",87.995094228052693,75.647441442822569,93.444005212382692,98.00812518478773,96.351332114190598,93.955388136354173,86.54745348824477,92.460660746159149,88.74738559586514,98.315830969875492,null,null,null,null,null,null,null,null,null,null,null,null,null,null,null,null,"Kinase 7",22622.185430463578,25117.218543046358,154.30463576158942,139.73509933774835,121.19205298013244,120.52980132450331,98.675496688741731,94.701986754966882,109.27152317880795,117.88079470198676,null,null,null,null,null,null,null,null,null,null,null,null,null,null,null,null,null,null,null,null,null,null,null,10000,2500,625,156.25,39.0625,9.765625,2.44140625,0.6103515625,0.152587890625,3.814697265625E-2]
["Kinase 8",93.466747523751764,83.038204972710744,93.994340004042854,98.55670103092784,100.68526379624015,82.567212451991097,91.113806347281184,91.853648675965232,87.244794825146556,96.492823933697196,null,null,null,null,null,null,null,null,null,null,null,null,null,null,null,null,"Kinase 8",37267.34693877551,49078.571428571428,261.22448979591837,173.46938775510205,138.77551020408163,122.44897959183673,124.48979591836735,124.48979591836735,118.36734693877551,95.918367346938766,null,null,null,null,null,null,null,null,null,null,null,null,null,null,null,null,null,null,null,null,null,null,"Kinase 1",{"$f":"$BV$2","v":1.646060495378086},{"$f":"$BW$2","v":2.4369948559706254},{"$f":"$BX$2","v":2.171057505742406},{"$f":"$BY$2","v":1.3182239343209026},{"$f":"$BZ$2","v":4.0165710137916619},{"$f":"$CA$2","v":1.4603628628911429},{"$f":"$CB$2","v":5.1651452591738707},{"$f":"$CC$2","v":2.5126494469838261},{"$f":"$CD$2","v":6.2197244066305863},{"$f":"$CE$2","v":3.2577325402956303},null,null,null,"Kinase 1",{"$f":"$BV$3","v":11565.783969835227},{"$f":"$BW$3","v":617.50393715832865},{"$f":"$BX$3","v":17.272837403029968},{"$f":"$BY$3","v":14.034180389961909},{"$f":"$BZ$3","v":6.4773140261363151},{"$f":"$CA$3","v":25.909256104545182},{"$f":"$CB$3","v":18.352389740719492},{"$f":"$CC$3","v":10.795523376893863},{"$f":"$CD$3","v":14.034180389962039},{"$f":"$CE$3","v":9.7159710392044634}]
[null,null,null,null,null,null,null,null,null,null,null,null,null,null,null,null,null,null,null,null,null,null,null,null,null,null,null,null,null,null,null,null,null,null,null,null,null,null,null,null,null,null,null,null,null,null,null,null,null,null,null,null,null,null,null,null,null,null,null,null,"Kinase 2",{"$f":"$BV$4","v":0.13526083980613898},{"$f":"$BW$4","v":0.28281811959465447},{"$f":"$BX$4","v":1.6846122775855497},{"$f":"$BY$4","v":1.2849779781583197},{"$f":"$BZ$4","v":1.7829837974445619},{"$f":"$CA$4","v":11.583246463398508},{"$f":"$CB$4","v":2.9449973757791201},{"$f":"$CC$4","v":5.7485856917609004},{"$f":"$CD$4","v":4.8325009130738756},{"$f":"$CE$4","v":0.15985371977089799},null,null,null,"Kinase 2",{"$f":"$BV$5","v":962.38431405558845},{"$f":"$BW$5","v":975.56766082347201},{"$f":"$BX$5","v":26.366693535769556},{"$f":"$BY$5","v":11.98486069807708},{"$f":"$BZ$5","v":21.572749256538714},{"$f":"$CA$5","v":14.381832837692457},{"$f":"$CB$5","v":9.5878885584616551},{"$f":"$CC$5","v":35.954582094231235},{"$f":"$CD$5","v":4.7939442792308178},{"$f":"$CE$5","v":47.939442792308292}]
[null,null,null,null,null,null,null,null,null,null,null,null,null,null,null,null,null,null,null,null,null,null,null,null,null,null,null,null,null,null,null,null,null,null,null,null,null,null,null,null,null,null,null,null,null,null,null,null,null,null,null,null,null,null,null,null,null,null,null,null,"Kinase 3",{"$f":"$BV$6","v":0.99560268592376711},{"$f":"$BW$6","v":4.6175365950602387},{"$f":"$BX$6","v":0.67517883298278025},{"$f":"$BY$6","v":4.377218705354502},{"$f":"$BZ$6","v":6.2940399684835988},{"$f":"$CA$6","v":3.593324636552448},{"$f":"$CB$6","v":1.6135629737385295},{"$f":"$CC$6","v":8.8288215194274393},{"$f":"$CD$6","v":1.2244768665959089},{"$f":"$CE$6","v":2.2601325341372958},null,null,null,"Kinase 3",{"$f":"$BV$7","v":1161.5407392291029},{"$f":"$BW$7","v":11.313708498982187},{"$f":"$BX$7","v":52.79730632859561},{"$f":"$BY$7","v":32.055507413790139},{"$f":"$BZ$7","v":3.7712361663282499},{"$f":"$CA$7","v":30.169889330626095},{"$f":"$CB$7","v":1.88561808316414},{"$f":"$CC$7","v":16.970562748477139},{"$f":"$CD$7","v":11.313708498984761},{"$f":"$CE$7","v":22.627416997969441}]
[{"$f":"$B$19/20","v":500},"IC50",1261.3036404733646,null,null,null,null,null,null,null,null,null,null,null,null,null,null,null,null,null,null,null,null,null,null,null,null,{"$f":"$AC$19/20","v":500},"IC50",769.57301133036401,null,null,null,null,null,null,null,null,null,null,null,null,null,null,null,null,null,null,null,null,null,null,null,null,null,null,null,null,null,null,"Kinase 4",{"$f":"$BV$8","v":0.55973281726383517},{"$f":"$BW$8","v":12.853744635969141},{"$f":"$BX$8","v":12.361045689036294},{"$f":"$BY$8","v":2.6578929586241298},{"$f":"$BZ$8","v":3.9013712532641667},{"$f":"$CA$8","v":5.1549046284538633},{"$f":"$CB$8","v":2.1417321570754337},{"$f":"$CC$8","v":19.614110458850398},{"$f":"$CD$8","v":10.872893767688113},{"$f":"$CE$8","v":4.2935193947005166},null,null,null,"Kinase 4",{"$f":"$BV$9","v":1826.6925180652468},{"$f":"$BW$9","v":5364.1906095012146},{"$f":"$BX$9","v":19.641855032959668},{"$f":"$BY$9","v":27.498597046143512},{"$f":"$BZ$9","v":23.570226039551411},{"$f":"$CA$9","v":0},{"$f":"$CB$9","v":15.713484026367727},{"$f":"$CC$9","v":72.67486362195072},{"$f":"$CD$9","v":5.8925565098879025},{"$f":"$CE$9","v":25.534411542847455}]
[1,"HillSlope",0,null,null,null,null,null,"CAMK-1",null,{"$f":"I45&\" Dose-Response using \"&I44","v":"CHK2 Inhibitor Dose-Response using CAMK-1"},null,"IC50",null,null,null,null,null,null,null,null,null,null,null,null,null,null,1,"HillSlope",0,null,null,null,null,null,"TK-3",null,{"$f":"AJ45&\" Dose-Response using \"&AJ44","v":"Blank Dose-Response using TK-3"},null,"IC50",null,null,null,null,null,null,null,null,null,null,null,null,null,null,null,null,null,null,null,null,"Kinase 5",{"$f":"$BV$10","v":1.7329921519081701},{"$f":"$BW$10","v":0.49431948611642607},{"$f":"$BX$10","v":1.8019669639244389},{"$f":"$BY$10","v":4.8972116531534624},{"$f":"$BZ$10","v":5.6530606348314842},{"$f":"$CA$10","v":1.4829584583492983},{"$f":"$CB$10","v":2.7417487776457681},{"$f":"$CC$10","v":11.547533111719829},{"$f":"$CD$10","v":9.7656838013001472},{"$f":"$CE$10","v":1.1179667447633186},null,null,null,"Kinase 5",{"$f":"$BV$11","v":527.86343432763454},{"$f":"$BW$11","v":3510.0451731225239},{"$f":"$BX$11","v":37.82199062160597},{"$f":"$BY$11","v":24.666515622786733},{"$f":"$BZ$11","v":18.088778123376649},{"$f":"$CA$11","v":16.444343748524304},{"$f":"$CB$11","v":11.511040623967048},{"$f":"$CC$11","v":0},{"$f":"$CD$11","v":18.088778123376851},{"$f":"$CE$11","v":37.82199062160597}]
[100,"Top",204.05938865818234,"Min",{"$f":"MIN(D48:D57)","v":102.02969432909117},null,null,null,"CHK2 Inhibitor","(nM)",{"$f":"I45&\" \"&J45","v":"CHK2 Inhibitor (nM)"},"CHK1",{"$f":"IF(AND(MAX(C55:C57)>60,MIN(C48:C50)<40, E45<E46, C45>25,C44>0.2), C43,\"N/C\")","v":"N/C"},null,null,null,null,null,null,null,null,null,null,null,null,null,null,100,"Top",8228.778256764459,"Min",{"$f":"MIN(AE48:AE57)","v":4114.3891283822295},null,null,null,"Blank","(nM)",{"$f":"AJ45&\" \"&AK45","v":"Blank (nM)"},"AXL1",{"$f":"IF(AND(MAX(AD55:AD57)>60,MIN(AD48:AD50)<40, AF45<AF46, AD45>25,AD44>0.2), AD43,\"N/C\")","v":"N/C"},null,null,null,null,null,null,null,null,null,null,null,null,null,null,null,null,null,null,null,null,"Kinase 6",{"$f":"$BV$12","v":5.9747087552728964},{"$f":"$BW$12","v":6.6966527298683687},{"$f":"$BX$12","v":4.1922539766164801},{"$f":"$BY$12","v":4.252001064169197},{"$f":"$BZ$12","v":6.2186760294465326},{"$f":"$CA$12","v":2.0861691403827791},{"$f":"$CB$12","v":6.3282123566265502},{"$f":"$CC$12","v":13.059717554234016},{"$f":"$CD$12","v":7.3887231606874835},{"$f":"$CE$12","v":1.638065983737311},null,null,null,"Kinase 6",{"$f":"$BV$13","v":43.041282333095928},{"$f":"$BW$13","v":340.48728702786838},{"$f":"$BX$13","v":32.28096174982069},{"$f":"$BY$13","v":27.669395785560642},{"$f":"$BZ$13","v":23.057829821300377},{"$f":"$CA$13","v":15.371886547533633},{"$f":"$CB$13","v":12.297509238026928},{"$f":"$CC$13","v":3.0743773095067244},{"$f":"$CD$13","v":10.760320583273561},{"$f":"$CE$13","v":10.760320583273561}]
[0,"Bottom",0,"50%",{"$f":"(C45+C46)/2","v":102.02969432909117},null,null,null,null,null,null,"CHK2",{"$f":"IF(AND(MAX(C72:C74)>60,MIN(C65:C67)<40, E62<E63, C62>25, C61>0.2), C60,\"N/C\")","v":36.062077050805968},null,null,null,null,null,null,null,null,null,null,null,null,null,null,0,"Bottom",0,"50%",{"$f":"(AD45+AD46)/2","v":4114.3891283822295},null,null,null,null,null,null,"EPHA1",{"$f":"IF(AND(MAX(AD72:AD74)>60,MIN(AD65:AD67)<40, AF62<AF63, AD62>25, AD61>0.2), AD60,\"N/C\")","v":"N/C"},null,null,null,null,null,null,null,null,null,null,null,null,null,null,null,null,null,null,null,null,"Kinase 7",{"$f":"$BV$14","v":4.9741614331231423},{"$f":"$BW$14","v":2.8711380127678341},{"$f":"$BX$14","v":2.4189415188475492},{"$f":"$BY$14","v":3.1498892761433668},{"$f":"$BZ$14","v":1.4882220227992871},{"$f":"$CA$14","v":3.6779680584269716},{"$f":"$CB$14","v":11.871706583537348},{"$f":"$CC$14","v":3.8096005994654147},{"$f":"$CD$14","v":6.6729955215839398},{"$f":"$CE$14","v":0.73559361168539827},null,null,null,"Kinase 7",{"$f":"$BV$15","v":1920.4270924808159},{"$f":"$BW$15","v":1487.2656536744848},{"$f":"$BX$15","v":29.97008873903258},{"$f":"$BY$15","v":0},{"$f":"$BZ$15","v":22.477566554274425},{"$f":"$CA$15","v":10.302218004042413},{"$f":"$CB$15","v":11.238783277137172},{"$f":"$CC$15","v":18.731305461895261},{"$f":"$CD$15","v":0},{"$f":"$CE$15","v":0.93656527309477855}]
["Kinase 1",null,"Raw","Analysis","Sqare difference",null,null,null,null,null,null,"MAPKAPK2",{"$f":"IF(AND(MAX(C89:C91)>60,MIN(C82:C84)<40, E79<E80, C79>25, C78>0.2), C77,\"N/C\")","v":"N/C"},null,null,null,null,null,null,null,null,null,null,null,null,null,null,"Kinase 1",null,"Raw","Analysis","Sqare difference",null,null,null,null,null,null,"FAK",{"$f":"IF(AND(MAX(AD89:AD91)>60,MIN(AD82:AD84)<40, AF79<AF80, AD79>25, AD78>0.2), AD77,\"N/C\")","v":"N/C"},null,null,null,null,null,null,null,null,null,null,null,null,null,null,null,null,null,null,null,null,"Kinase 8",{"$f":"$BV$16","v":0.29730788454983093},{"$f":"$BW$16","v":6.5779369456650301},{"$f":"$BX$16","v":0.47169039375694333},{"$f":"$BY$16","v":2.9502090082252552},{"$f":"$BZ$16","v":1.3807664253612342},{"$f":"$CA$16","v":3.9050247143756742},{"$f":"$CB$16","v":1.8009996852537835},{"$f":"$CC$16","v":11.189067885846562},{"$f":"$CD$16","v":15.042635466357872},{"$f":"$CE$16","v":0.50599514966653925},null,null,null,"Kinase 8",{"$f":"$BV$17","v":929.34034098803613},{"$f":"$BW$17","v":1031.7986705068997},{"$f":"$BX$17","v":77.926053436884956},{"$f":"$BY$17","v":40.40610178208825},{"$f":"$BZ$17","v":31.747651400212376},{"$f":"$CA$17","v":8.6584503818761025},{"$f":"$CB$17","v":0},{"$f":"$CC$17","v":11.54460050916812},{"$f":"$CD$17","v":2.8861501272920376},{"$f":"$CE$17","v":0}]
[null,{"$f":"$B$32","v":10000},{"$f":"$B$33","v":105.69487898584791},{"$f":"$C$46+($C$45-$C$46)/(1+((B48/$C$43)^$C$44))","v":102.02969432909117},{"$f":"(C48-D48)^2","v":13.433578568124993},null,null,null,null,null,null,"MARK1",{"$f":"IF(AND(MAX(C106:C108)>60,MIN(C99:C101)<40, E96<E97, C96>25, C95>0.2), C94,\"N/C\")","v":"N/C"},null,null,null,null,null,null,null,null,null,null,null,null,null,null,null,{"$f":"$AC$32","v":10000},{"$f":"$AC$33","v":16469.847328244272},{"$f":"$AD$46+($AD$45-$AD$46)/(1+((AC48/$AD$43)^$AD$44))","v":4114.3891283822295},{"$f":"(AD48-AE48)^2","v":152657347.32853815},null,null,null,null,null,null,"ITK",{"$f":"IF(AND(MAX(AD106:AD108)>60,MIN(AD99:AD101)<40, AF96<AF97, AD96>25, AD95>0.2), AD94,\"N/C\")","v":"N/C"}]
[null,{"$f":"$C$32","v":2500},{"$f":"$C$33","v":96.372007067939762},{"$f":"$C$46+($C$45-$C$46)/(1+((B49/$C$43)^$C$44))","v":102.02969432909117},{"$f":"(C49-D49)^2","v":32.009425144994935},null,null,null,null,null,null,"MELK",{"$f":"IF(AND(MAX(C123:C125)>60,MIN(C116:C118)<40, E113<E114, C113>25, C112>0.2), C111,\"N/C\")","v":"N/C"},null,null,null,null,null,null,null,null,null,null,null,null,null,null,null,{"$f":"$AD$32","v":2500},{"$f":"$AD$33","v":23910.687022900762},{"$f":"$AD$46+($AD$45-$AD$46)/(1+((AC49/$AD$43)^$AD$44))","v":4114.3891283822295},{"$f":"(AD49-AE49)^2","v":391893410.32851887},null,null,null,null,null,null,"JAK3",{"$f":"IF(AND(MAX(AD123:AD125)>60,MIN(AD116:AD118)<40, AF113<AF114, AD113>25, AD112>0.2), AD111,\"N/C\")","v":"N/C"}]
[null,{"$f":"$D$32","v":625},{"$f":"$D$33","v":106.58809797850439},102.02969432909117,20.779043830983781,null,null,null,null,null,null,"PASK",{"$f":"IF(AND(MAX(C140:C142)>60,MIN(C133:C135)<40, E130<E131, C130>25, C129>0.2), C128,\"N/C\")","v":"N/C"},null,null,null,null,null,null,null,null,null,null,null,null,null,null,null,{"$f":"$AE$32","v":625},{"$f":"$AE$33","v":116.03053435114504},4114.3891283822295,15986871.446462231,null,null,null,null,null,null,"PYK2",{"$f":"IF(AND(MAX(AD140:AD142)>60,MIN(AD133:AD135)<40, AF130<AF131, AD130>25, AD129>0.2), AD128,\"N/C\")","v":"N/C"}]
[null,{"$f":"$E$32","v":156.25},{"$f":"$E$33","v":104.77248042537326},102.02969432909117,7.5228755699583392,null,null,null,null,null,null,"PIM1",{"$f":"IF(AND(MAX(C157:C159)>60,MIN(C150:C152)<40, E147<E148, C147>25, C146>0.2), C145,\"N/C\")","v":"N/C"},null,null,null,null,null,null,null,null,null,null,null,null,null,null,null,{"$f":"$AF$32","v":156.25},{"$f":"$AF$33","v":92.36641221374046},4114.3891283822295,16176666.729375349,null,null,null,null,null,null,"SYK",{"$f":"IF(AND(MAX(AD157:AD159)>60,MIN(AD150:AD152)<40, AF147<AF148, AD147>25, AD146>0.2), AD145,\"N/C\")","v":"N/C"}]
[null,{"$f":"$F$32","v":39.0625},{"$f":"$F$33","v":100.87052377324233},102.02969432909117,1.3436763775469218,null,null,null,null,null,null,"PKCmu (PKD1)",{"$f":"IF(AND(MAX(C174:C176)>60,MIN(C167:C169)<40, E164<E165, C164>25, C163>0.2), C162,\"N/C\")","v":"N/C"},null,null,null,null,null,null,null,null,null,null,null,null,null,null,null,{"$f":"$AG$32","v":39.0625},{"$f":"$AG$33","v":99.236641221374043},4114.3891283822295,16121449.495154003,null,null,null,null,null,null,"TRKA",{"$f":"IF(AND(MAX(AD174:AD176)>60,MIN(AD167:AD169)<40, AF164<AF165, AD164>25, AD163>0.2), AD162,\"N/C\")","v":"N/C"}]
[null,{"$f":"$G$32","v":9.765625},{"$f":"$G$33","v":98.359459853777935},102.02969432909117,13.470621103777829,null,null,null,null,null,null,null,null,null,null,null,null,null,null,null,null,null,null,null,null,null,null,null,{"$f":"$AH$32","v":9.765625},{"$f":"$AH$33","v":87.022900763358777},4114.3891283822295,16219678.731365053]
[null,{"$f":"$H$32","v":2.44140625},{"$f":"$H$33","v":96.359038371131675},102.02969432909117,32.156338993541539,null,null,null,null,null,null,null,null,null,null,null,null,null,null,null,null,null,null,null,null,null,null,null,{"$f":"$AI$32","v":2.44140625},{"$f":"$AI$33","v":84.732824427480907},4114.3891283822295,16238129.928002246]
[null,{"$f":"$I$32","v":0.6103515625},{"$f":"$I$33","v":105.5651920177671},102.02969432909117,12.499743906632855,null,null,null,null,null,null,null,null,null,null,null,null,null,null,null,null,null,null,null,null,null,null,null,{"$f":"$AJ$32","v":0.6103515625},{"$f":"$AJ$33","v":85.496183206106863},4114.3891283822295,16231978.363689933]
[null,{"$f":"$J$32","v":0.152587890625},{"$f":"$J$33","v":100.25937393616159},102.02969432909117,3.1340342936223311,null,null,null,null,null,null,null,null,null,null,null,null,null,null,null,null,null,null,null,null,null,null,null,{"$f":"$AK$32","v":0.152587890625},{"$f":"$AK$33","v":98.473282442748086},4114.3891283822295,16127580.081667818]
[null,{"$f":"$K$32","v":3.814697265625E-2},{"$f":"$K$33","v":105.45333700779742},102.02969432909117,11.721329191458867,null,null,null,null,null,null,null,null,null,null,null,null,null,null,null,null,null,null,null,null,null,null,null,{"$f":"$AL$32","v":3.814697265625E-2},{"$f":"$AL$33","v":100},4114.3891283822295,16115320.074073436]
[null,null,null,null,{"$f":"SQRT(AVERAGE(E48:E57))","v":3.8479951530718224},null,null,null,null,null,null,null,null,null,null,null,null,null,null,null,null,null,null,null,null,null,null,null,null,null,null,{"$f":"SQRT(AVERAGE(AF48:AF57))","v":8208.3398595991821}]
[]
[null,"IC50",36.062077050805968,null,null,null,null,null,null,null,null,null,null,null,null,null,null,null,null,null,null,null,null,null,null,null,null,null,"IC50",713.0739282192875]
[null,"HillSlope",0.47132799595514069,null,null,null,null,null,null,null,null,null,null,null,null,null,null,null,null,null,null,null,null,null,null,null,null,null,"HillSlope",0]
[null,"Top",105.68417300550283,"Min",{"$f":"MIN(D65:D74)","v":6.965749176667277},null,null,null,null,null,null,null,null,null,null,null,null,null,null,null,null,null,null,null,null,null,null,null,"Top",3382.2032633128324,"Min",{"$f":"MIN(AE65:AE74)","v":1691.1016316564162}]
[null,"Bottom",0,"50%",{"$f":"(C62+C63)/2","v":52.842086502751414},null,null,null,"Raw","Analysis","Raw","Analysis","Raw","Analysis","Raw","Analysis","Raw","Analysis","Raw","Analysis","Raw","Analysis","Raw","Analysis",null,null,null,null,"Bottom",0,"50%",{"$f":"(AD62+AD63)/2","v":1691.1016316564162},null,null,null,"Raw","Analysis","Raw","Analysis","Raw","Analysis","Raw","Analysis","Raw","Analysis","Raw","Analysis","Raw","Analysis","Raw","Analysis"]
["Kinase 2",null,"Raw","Analysis","Sqare difference",null,null,null,{"$f":"$L$45","v":"CHK1"},null,{"$f":"$L$46","v":"CHK2"},null,{"$f":"$L$47","v":"MAPKAPK2"},null,{"$f":"$L$48","v":"MARK1"},null,{"$f":"$L$49","v":"MELK"},null,{"$f":"$L$50","v":"PASK"},null,{"$f":"$L$51","v":"PIM1"},null,{"$f":"$L$52","v":"PKCmu (PKD1)"},null,null,null,null,"Kinase 2",null,"Raw","Analysis","Sqare difference",null,null,null,{"$f":"$AM$45","v":"AXL1"},null,{"$f":"$AM$46","v":"EPHA1"},null,{"$f":"$AM$47","v":"FAK"},null,{"$f":"$AM$48","v":"ITK"},null,{"$f":"$AM$49","v":"JAK3"},null,{"$f":"$AM$50","v":"PYK2"},null,{"$f":"$AM$51","v":"SYK"},null,{"$f":"$AM$52","v":"TRKA"}]
[null,{"$f":"$B$32","v":10000},{"$f":"$B$34","v":3.1562472828449697},{"$f":"$C$63+($C$62-$C$63)/(1+((B65/$C$60)^$C$61))","v":6.965749176667277},{"$f":"(C65-D65)^2","v":14.512304679035745},null,null,{"$f":"B48","v":10000},{"$f":"C48","v":105.69487898584791},{"$f":"D48","v":102.02969432909117},{"$f":"C65","v":3.1562472828449697},{"$f":"D65","v":6.965749176667277},{"$f":"C82","v":98.462534390678101},{"$f":"D82","v":97.544378307664402},{"$f":"C99","v":114.71536237379722},{"$f":"D99","v":112.67267298263364},{"$f":"C116","v":102.70078036091692},{"$f":"D116","v":109.87603641684012},{"$f":"C133","v":94.374031826503312},{"$f":"D133","v":99.364646812391499},{"$f":"C150","v":87.995094228052693},{"$f":"D150","v":87.245054312728129},{"$f":"C167","v":93.466747523751764},{"$f":"D167","v":91.750547654341304},null,null,null,null,{"$f":"$AC$32","v":10000},{"$f":"$AC$34","v":12590.677966101695},{"$f":"$AD$63+($AD$62-$AD$63)/(1+((AC65/$AD$60)^$AD$61))","v":1691.1016316564162},{"$f":"(AD65-AE65)^2","v":118800764.27039959},null,null,{"$f":"AC48","v":10000},{"$f":"AD48","v":16469.847328244272},{"$f":"AE48","v":4114.3891283822295},{"$f":"AD65","v":12590.677966101695},{"$f":"AE65","v":1691.1016316564162},{"$f":"AD82","v":16406.666666666668},{"$f":"AE82","v":3453.4664922155685},{"$f":"AD99","v":22738.888888888887},{"$f":"AE99","v":5759.5833368053554},{"$f":"AD116","v":3420.9302325581398},{"$f":"AE116","v":3347.9651163119956},{"$f":"AD133","v":14627.173913043478},{"$f":"AE133","v":3219.9456521505053},{"$f":"AD150","v":22622.185430463578},{"$f":"AE150","v":4869.5695332530477},{"$f":"AD167","v":37267.34693877551},{"$f":"AE167","v":8750.50980785092}]
[null,{"$f":"$C$32","v":2500},{"$f":"$C$34","v":4.4952612816276849},{"$f":"$C$63+($C$62-$C$63)/(1+((B66/$C$60)^$C$61))","v":12.621548613877852},{"$f":"(C66-D66)^2","v":66.036545806289553},null,null,2500,96.372007067939762,102.02969432909117,4.4952612816276849,12.621548613877852,84.872147596698497,97.54593541090594,98.921647627624779,112.68605462095064,100,109.87603641684012,91.455428812843266,100.4395475441287,75.647441442822569,88.11273910647418,83.038204972710744,91.78406299120671,null,null,null,null,{"$f":"$AD$32","v":2500},{"$f":"$AD$34","v":3740.6779661016949},{"$f":"$AD$63+($AD$62-$AD$63)/(1+((AC66/$AD$60)^$AD$61))","v":1691.1016316564162},{"$f":"(AD66-AE66)^2","v":4200763.150718146},null,null,2500,23910.687022900762,4114.3891283822295,3740.6779661016949,1691.1016316564162,17113.333333333332,3453.4664922155685,33641.666666666672,5759.5833368053554,29105.232558139534,3347.9651163119956,16502.717391304348,3219.9456521505053,25117.218543046358,4869.5695332530477,49078.571428571428,8750.50980785092]
[null,{"$f":"$D$32","v":625},{"$f":"$D$34","v":17.815842100686897},21.852982248683755,16.298500574568095,null,null,625,106.58809797850439,102.02969432909117,17.815842100686897,21.852982248683755,102.29001456546368,97.547492514147862,112.84068824951414,112.69943625943,116.08071858234435,109.87603641684012,105.4781016758203,101.51454828815979,93.444005212382692,88.980516454739615,93.994340004042854,91.817578332809191,null,null,null,null,{"$f":"$AE$32","v":625},{"$f":"$AE$34","v":42.372881355932201},1691.1016316564162,2718306.4920673962,null,null,625,116.03053435114504,4114.3891283822295,42.372881355932201,1691.1016316564162,188,3453.4664922155685,208.33333333333334,5759.5833368053554,176.74418604651163,3347.9651163119956,166.30434782608697,3219.9456521505053,154.30463576158942,4869.5695332530477,261.22448979591837,8750.50980785092]
[null,{"$f":"$E$32","v":156.25},{"$f":"$E$34","v":40.113903138857495},35.276895497279661,23.396642924682361,null,null,156.25,104.77248042537326,102.02969432909117,40.113903138857495,35.276895497279661,105.92733452014889,97.549049617389343,116.04730530407168,112.71281789769435,121.61030726711104,109.87603641684012,112.75876637093367,102.5894049212009,98.00812518478773,89.848219861529742,98.55670103092784,91.851093670214453,null,null,null,null,{"$f":"$AF$32","v":156.25},{"$f":"$AF$34","v":86.440677966101703},1691.1016316564162,2574936.7762983097,null,null,156.25,92.36641221374046,4114.3891283822295,86.440677966101703,1691.1016316564162,136,3453.4664922155685,172.22222222222223,5759.5833368053554,146.51162790697674,3347.9651163119956,150,3219.9456521505053,139.73509933774835,4869.5695332530477,173.46938775510205,8750.50980785092]
[null,{"$f":"$F$32","v":39.0625},{"$f":"$F$34","v":62.924963046691595},51.846948378624141,122.72240898591765,null,null,39.0625,100.87052377324233,102.02969432909117,62.924963046691595,51.846948378624141,100.43696391001779,97.550606720629631,119.1923022230649,112.72619953536631,117.10494228580718,109.87603641684012,108.36149838050979,103.66387345084762,96.351332114190598,90.715682887588542,100.68526379624015,91.884608994488289,null,null,null,null,{"$f":"$AG$32","v":39.0625},{"$f":"$AG$34","v":62.711864406779661},1691.1016316564162,2651653.2340833256,null,null,39.0625,99.236641221374043,4114.3891283822295,62.711864406779661,1691.1016316564162,121.33333333333334,3453.4664922155685,133.33333333333331,5759.5833368053554,125.58139534883721,3347.9651163119956,127.17391304347827,3219.9456521505053,121.19205298013244,4869.5695332530477,138.77551020408163,8750.50980785092]
[null,{"$f":"$G$32","v":9.765625},{"$f":"$G$34","v":67.385444743935309},68.615116096661652,1.512091635715832,null,null,9.765625,98.359459853777935,102.02969432909117,67.385444743935309,68.615116096661652,99.741058423693147,97.552163823867872,117.1920178224392,112.73958117206853,113.69289546415217,109.87603641684012,107.33347415856922,104.73771023703421,93.955388136354173,91.58273927806529,82.567212451991097,91.918124296696433,null,null,null,null,{"$f":"$AH$32","v":9.765625},{"$f":"$AH$34","v":54.237288135593218},1691.1016316564162,2679324.8790898547,null,null,9.765625,87.022900763358777,4114.3891283822295,54.237288135593218,1691.1016316564162,126.66666666666666,3453.4664922155685,133.33333333333331,5759.5833368053554,115.11627906976744,3347.9651163119956,128.26086956521738,3219.9456521505053,120.52980132450331,4869.5695332530477,122.44897959183673,8750.50980785092]
[null,{"$f":"$H$32","v":2.44140625},{"$f":"$H$34","v":74.51960699069646},82.496401571597815,63.629251785897232,null,null,2.44140625,96.359038371131675,102.02969432909117,74.51960699069646,82.496401571597815,94.21427415439392,97.553720927103313,118.60217092477603,112.75296280742359,112.07527231344497,109.87603641684012,106.97436980706942,105.81067221281363,86.54745348824477,92.449223089880306,91.113806347281184,91.951639567904706,null,null,null,null,{"$f":"$AI$32","v":2.44140625},{"$f":"$AI$34","v":77.966101694915253},1691.1016316564162,2602206.2380241724,null,null,2.44140625,84.732824427480907,4114.3891283822295,77.966101694915253,1691.1016316564162,130.66666666666666,3453.4664922155685,161.11111111111111,5759.5833368053554,104.65116279069768,3347.9651163119956,113.04347826086956,3219.9456521505053,98.675496688741731,4869.5695332530477,124.48979591836735,8750.50980785092]
[null,{"$f":"$I$32","v":0.6103515625},{"$f":"$I$34","v":85.475176071645947},92.201005401820808,45.236780178640416,null,null,0.6103515625,105.5651920177671,102.02969432909117,85.475176071645947,92.201005401820808,97.204240168312026,97.55527803033516,114.670332274731,112.76634444105416,105.73483986343683,109.87603641684012,104.74228981833545,106.88251710403323,92.460660746159149,93.31496881858331,91.853648675965232,91.985154799178886,null,null,null,null,{"$f":"$AJ$32","v":0.6103515625},{"$f":"$AJ$34","v":72.881355932203391},1691.1016316564162,2618636.8607649473,null,null,0.6103515625,85.496183206106863,4114.3891283822295,72.881355932203391,1691.1016316564162,114.66666666666667,3453.4664922155685,137.5,5759.5833368053554,101.16279069767442,3347.9651163119956,121.73913043478262,3219.9456521505053,94.701986754966882,4869.5695332530477,124.48979591836735,8750.50980785092]
[null,{"$f":"$J$32","v":0.152587890625},{"$f":"$J$34","v":98.252325884705684},98.211901131237951,1.6341606929269462E-3,null,null,0.152587890625,100.25937393616159,102.02969432909117,98.252325884705684,98.211901131237951,95.217672762582936,97.556835133562615,112.01592643503815,112.77972607258285,103.95870590147945,109.87603641684012,103.14744402196874,107.95300364748537,88.74738559586514,94.179811524498291,87.244794825146556,92.018669981584878,null,null,null,null,{"$f":"$AK$32","v":0.152587890625},{"$f":"$AK$34","v":84.745762711864401},1691.1016316564162,2580379.1776926056,null,null,0.152587890625,98.473282442748086,4114.3891283822295,84.745762711864401,1691.1016316564162,97.333333333333343,3453.4664922155685,143.05555555555557,5759.5833368053554,88.372093023255815,3347.9651163119956,135.86956521739131,3219.9456521505053,109.27152317880795,4869.5695332530477,118.36734693877551,8750.50980785092]
[null,{"$f":"$K$32","v":3.814697265625E-2},{"$f":"$K$34","v":109.83392748456654},101.6600509842431,66.812257042539841,null,null,3.814697265625E-2,105.45333700779742,102.02969432909117,109.83392748456654,101.6600509842431,97.212332092571614,97.558392236784869,103.13077688770915,112.79310770163227,105.801902129735,109.87603641684012,107.35459794395155,109.02189180711686,98.315830969875492,95.043586957951007,96.492823933697196,92.052185106188603,null,null,null,null,{"$f":"$AL$32","v":3.814697265625E-2},{"$f":"$AL$34","v":98.305084745762713},1691.1016316564162,2537000.8398505016,null,null,3.814697265625E-2,100,4114.3891283822295,98.305084745762713,1691.1016316564162,100,3453.4664922155685,126.38888888888889,5759.5833368053554,95.348837209302332,3347.9651163119956,127.17391304347827,3219.9456521505053,117.88079470198676,4869.5695332530477,95.918367346938766,8750.50980785092]
[null,null,null,null,{"$f":"SQRT(AVERAGE(E65:E74))","v":6.4819628028397354},null,null,null,null,null,null,null,null,null,null,null,null,null,null,null,null,null,null,null,null,null,null,null,null,null,null,{"$f":"SQRT(AVERAGE(AF65:AF74))","v":3794.2584508568848}]
[]
[null,"IC50",1319.0097278879689,null,null,null,null,null,"Kinase 1","Kinase 2","Kinase 3","Kinase 4","Kinase 5","Kinase 6","Kinase 7","Kinase 8",null,null,null,null,null,null,null,null,null,null,null,null,"IC50",762.30728965237529,null,null,null,null,null,"Kinase 1","Kinase 2","Kinase 3","Kinase 4","Kinase 5","Kinase 6","Kinase 7","Kinase 8"]
[null,"HillSlope",2.3029238239597744E-5,null,null,null,null,{"$f":"H65","v":10000},{"$f":"$BV$2","v":1.646060495378086},{"$f":"$BV$4","v":0.13526083980613898},{"$f":"$BV$6","v":0.99560268592376711},{"$f":"$BV$8","v":0.55973281726383517},{"$f":"$BV$10","v":1.7329921519081701},{"$f":"$BV$12","v":5.9747087552728964},{"$f":"$BV$14","v":4.9741614331231423},{"$f":"$BV$16","v":0.29730788454983093},null,null,null,null,null,null,null,null,null,null,null,null,"HillSlope",0,null,null,null,null,{"$f":"AI65","v":10000},{"$f":"$BV$3","v":11565.783969835227},{"$f":"$BV$5","v":962.38431405558845},{"$f":"$BV$7","v":1161.5407392291029},{"$f":"$BV$9","v":1826.6925180652468},{"$f":"$BV$11","v":527.86343432763454},{"$f":"$BV$13","v":43.041282333095928},{"$f":"$BV$15","v":1920.4270924808159},{"$f":"$BV$17","v":929.34034098803613}]
[null,"Top",195.09330720733976,"Min",{"$f":"MIN(D82:D91)","v":97.544378307664402},null,null,2500,{"$f":"$BW$2","v":2.4369948559706254},{"$f":"$BW$4","v":0.28281811959465447},{"$f":"$BW$6","v":4.6175365950602387},{"$f":"$BW$8","v":12.853744635969141},{"$f":"$BW$10","v":0.49431948611642607},{"$f":"$BW$12","v":6.6966527298683687},{"$f":"$BW$14","v":2.8711380127678341},{"$f":"$BW$16","v":6.5779369456650301},null,null,null,null,null,null,null,null,null,null,null,null,"Top",6906.9329844311369,"Min",{"$f":"MIN(AE82:AE91)","v":3453.4664922155685},null,null,2500,{"$f":"$BW$3","v":617.50393715832865},{"$f":"$BW$5","v":975.56766082347201},{"$f":"$BW$7","v":11.313708498982187},{"$f":"$BW$9","v":5364.1906095012146},{"$f":"$BW$11","v":3510.0451731225239},{"$f":"$BW$13","v":340.48728702786838},{"$f":"$BW$15","v":1487.2656536744848},{"$f":"$BW$17","v":1031.7986705068997}]
[null,"Bottom",0,"50%",{"$f":"(C79+C80)/2","v":97.546653603669881},null,null,625,{"$f":"$BX$2","v":2.171057505742406},{"$f":"$BX$4","v":1.6846122775855497},{"$f":"$BX$6","v":0.67517883298278025},{"$f":"$BX$8","v":12.361045689036294},{"$f":"$BX$10","v":1.8019669639244389},{"$f":"$BX$12","v":4.1922539766164801},{"$f":"$BX$14","v":2.4189415188475492},{"$f":"$BX$16","v":0.47169039375694333},null,null,null,null,null,null,null,null,null,null,null,null,"Bottom",0,"50%",{"$f":"(AD79+AD80)/2","v":3453.4664922155685},null,null,625,{"$f":"$BX$3","v":17.272837403029968},{"$f":"$BX$5","v":26.366693535769556},{"$f":"$BX$7","v":52.79730632859561},{"$f":"$BX$9","v":19.641855032959668},{"$f":"$BX$11","v":37.82199062160597},{"$f":"$BX$13","v":32.28096174982069},{"$f":"$BX$15","v":29.97008873903258},{"$f":"$BX$17","v":77.926053436884956}]
["Kinase 3",null,"Raw","Analysis","Sqare difference",null,null,156.25,{"$f":"$BY$2","v":1.3182239343209026},{"$f":"$BY$4","v":1.2849779781583197},{"$f":"$BY$6","v":4.377218705354502},{"$f":"$BY$8","v":2.6578929586241298},{"$f":"$BY$10","v":4.8972116531534624},{"$f":"$BY$12","v":4.252001064169197},{"$f":"$BY$14","v":3.1498892761433668},{"$f":"$BY$16","v":2.9502090082252552},null,null,null,null,null,null,null,null,null,null,null,"Kinase 3",null,"Raw","Analysis","Sqare difference",null,null,156.25,{"$f":"$BY$3","v":14.034180389961909},{"$f":"$BY$5","v":11.98486069807708},{"$f":"$BY$7","v":32.055507413790139},{"$f":"$BY$9","v":27.498597046143512},{"$f":"$BY$11","v":24.666515622786733},{"$f":"$BY$13","v":27.669395785560642},{"$f":"$BY$15","v":0},{"$f":"$BY$17","v":40.40610178208825}]
[null,{"$f":"$B$32","v":10000},{"$f":"$B$35","v":98.462534390678101},{"$f":"$C$80+($C$79-$C$80)/(1+((B82/$C$77)^$C$78))","v":97.544378307664402},{"$f":"(C82-D82)^2","v":0.84301059277505808},null,null,39.0625,{"$f":"$BZ$2","v":4.0165710137916619},{"$f":"$BZ$4","v":1.7829837974445619},{"$f":"$BZ$6","v":6.2940399684835988},{"$f":"$BZ$8","v":3.9013712532641667},{"$f":"$BZ$10","v":5.6530606348314842},{"$f":"$BZ$12","v":6.2186760294465326},{"$f":"$BZ$14","v":1.4882220227992871},{"$f":"$BZ$16","v":1.3807664253612342},null,null,null,null,null,null,null,null,null,null,null,null,{"$f":"$AC$32","v":10000},{"$f":"$AC$35","v":16406.666666666668},{"$f":"$AD$80+($AD$79-$AD$80)/(1+((AC82/$AD$77)^$AD$78))","v":3453.4664922155685},{"$f":"(AD82-AE82)^2","v":167785394.75940001},null,null,39.0625,{"$f":"$BZ$3","v":6.4773140261363151},{"$f":"$BZ$5","v":21.572749256538714},{"$f":"$BZ$7","v":3.7712361663282499},{"$f":"$BZ$9","v":23.570226039551411},{"$f":"$BZ$11","v":18.088778123376649},{"$f":"$BZ$13","v":23.057829821300377},{"$f":"$BZ$15","v":22.477566554274425},{"$f":"$BZ$17","v":31.747651400212376}]
[null,{"$f":"$C$32","v":2500},{"$f":"$C$35","v":84.872147596698497},{"$f":"$C$80+($C$79-$C$80)/(1+((B83/$C$77)^$C$78))","v":97.54593541090594},{"$f":"(C83-D83)^2","v":160.62489755955309},null,null,9.765625,{"$f":"$CA$2","v":1.4603628628911429},{"$f":"$CA$4","v":11.583246463398508},{"$f":"$CA$6","v":3.593324636552448},{"$f":"$CA$8","v":5.1549046284538633},{"$f":"$CA$10","v":1.4829584583492983},{"$f":"$CA$12","v":2.0861691403827791},{"$f":"$CA$14","v":3.6779680584269716},{"$f":"$CA$16","v":3.9050247143756742},null,null,null,null,null,null,null,null,null,null,null,null,{"$f":"$AD$32","v":2500},{"$f":"$AD$35","v":17113.333333333332},{"$f":"$AD$80+($AD$79-$AD$80)/(1+((AC83/$AD$77)^$AD$78))","v":3453.4664922155685},{"$f":"(AD83-AE83)^2","v":186591962.11706862},null,null,9.765625,{"$f":"$CA$3","v":25.909256104545182},{"$f":"$CA$5","v":14.381832837692457},{"$f":"$CA$7","v":30.169889330626095},{"$f":"$CA$9","v":0},{"$f":"$CA$11","v":16.444343748524304},{"$f":"$CA$13","v":15.371886547533633},{"$f":"$CA$15","v":10.302218004042413},{"$f":"$CA$17","v":8.6584503818761025}]
[null,{"$f":"$D$32","v":625},{"$f":"$D$35","v":102.29001456546368},97.547492514147862,22.491515407216781,null,null,2.44140625,{"$f":"$CB$2","v":5.1651452591738707},{"$f":"$CB$4","v":2.9449973757791201},{"$f":"$CB$6","v":1.6135629737385295},{"$f":"$CB$8","v":2.1417321570754337},{"$f":"$CB$10","v":2.7417487776457681},{"$f":"$CB$12","v":6.3282123566265502},{"$f":"$CB$14","v":11.871706583537348},{"$f":"$CB$16","v":1.8009996852537835},null,null,null,null,null,null,null,null,null,null,null,null,{"$f":"$AE$32","v":625},{"$f":"$AE$35","v":188},3453.4664922155685,10663271.411782648,null,null,2.44140625,{"$f":"$CB$3","v":18.352389740719492},{"$f":"$CB$5","v":9.5878885584616551},{"$f":"$CB$7","v":1.88561808316414},{"$f":"$CB$9","v":15.713484026367727},{"$f":"$CB$11","v":11.511040623967048},{"$f":"$CB$13","v":12.297509238026928},{"$f":"$CB$15","v":11.238783277137172},{"$f":"$CB$17","v":0}]
[null,{"$f":"$E$32","v":156.25},{"$f":"$E$35","v":105.92733452014889},97.549049617389343,70.195657911808539,null,null,0.6103515625,{"$f":"$CC$2","v":2.5126494469838261},{"$f":"$CC$4","v":5.7485856917609004},{"$f":"$CC$6","v":8.8288215194274393},{"$f":"$CC$8","v":19.614110458850398},{"$f":"$CC$10","v":11.547533111719829},{"$f":"$CC$12","v":13.059717554234016},{"$f":"$CC$14","v":3.8096005994654147},{"$f":"$CC$16","v":11.189067885846562},null,null,null,null,null,null,null,null,null,null,null,null,{"$f":"$AF$32","v":156.25},{"$f":"$AF$35","v":136},3453.4664922155685,11005583.926973069,null,null,0.6103515625,{"$f":"$CC$3","v":10.795523376893863},{"$f":"$CC$5","v":35.954582094231235},{"$f":"$CC$7","v":16.970562748477139},{"$f":"$CC$9","v":72.67486362195072},{"$f":"$CC$11","v":0},{"$f":"$CC$13","v":3.0743773095067244},{"$f":"$CC$15","v":18.731305461895261},{"$f":"$CC$17","v":11.54460050916812}]
[null,{"$f":"$F$32","v":39.0625},{"$f":"$F$35","v":100.43696391001779},97.550606720629631,8.331057824732742,null,null,0.152587890625,{"$f":"$CD$2","v":6.2197244066305863},{"$f":"$CD$4","v":4.8325009130738756},{"$f":"$CD$6","v":1.2244768665959089},{"$f":"$CD$8","v":10.872893767688113},{"$f":"$CD$10","v":9.7656838013001472},{"$f":"$CD$12","v":7.3887231606874835},{"$f":"$CD$14","v":6.6729955215839398},{"$f":"$CD$16","v":15.042635466357872},null,null,null,null,null,null,null,null,null,null,null,null,{"$f":"$AG$32","v":39.0625},{"$f":"$AG$35","v":121.33333333333334},3453.4664922155685,11103111.388522502,null,null,0.152587890625,{"$f":"$CD$3","v":14.034180389962039},{"$f":"$CD$5","v":4.7939442792308178},{"$f":"$CD$7","v":11.313708498984761},{"$f":"$CD$9","v":5.8925565098879025},{"$f":"$CD$11","v":18.088778123376851},{"$f":"$CD$13","v":10.760320583273561},{"$f":"$CD$15","v":0},{"$f":"$CD$17","v":2.8861501272920376}]
[null,{"$f":"$G$32","v":9.765625},{"$f":"$G$35","v":99.741058423693147},97.552163823867872,4.791259569144251,null,null,3.814697265625E-2,{"$f":"$CE$2","v":3.2577325402956303},{"$f":"$CE$4","v":0.15985371977089799},{"$f":"$CE$6","v":2.2601325341372958},{"$f":"$CE$8","v":4.2935193947005166},{"$f":"$CE$10","v":1.1179667447633186},{"$f":"$CE$12","v":1.638065983737311},{"$f":"$CE$14","v":0.73559361168539827},{"$f":"$CE$16","v":0.50599514966653925},null,null,null,null,null,null,null,null,null,null,null,null,{"$f":"$AH$32","v":9.765625},{"$f":"$AH$35","v":126.66666666666666},3453.4664922155685,11067597.079272205,null,null,3.814697265625E-2,{"$f":"$CE$3","v":9.7159710392044634},{"$f":"$CE$5","v":47.939442792308292},{"$f":"$CE$7","v":22.627416997969441},{"$f":"$CE$9","v":25.534411542847455},{"$f":"$CE$11","v":37.82199062160597},{"$f":"$CE$13","v":10.760320583273561},{"$f":"$CE$15","v":0.93656527309477855},{"$f":"$CE$17","v":0}]
[null,{"$f":"$H$32","v":2.44140625},{"$f":"$H$35","v":94.21427415439392},97.553720927103313,11.151904747759186,null,null,null,null,null,null,null,null,null,null,null,null,null,null,null,null,null,null,null,null,null,null,null,{"$f":"$AI$32","v":2.44140625},{"$f":"$AI$35","v":130.66666666666666},3453.4664922155685,11040998.680667814]
[null,{"$f":"$I$32","v":0.6103515625},{"$f":"$I$35","v":97.204240168312026},97.55527803033516,0.12322758057377257,null,null,null,null,null,null,null,null,null,null,null,null,null,null,null,null,null,null,null,null,null,null,null,{"$f":"$AJ$32","v":0.6103515625},{"$f":"$AJ$35","v":114.66666666666667},3453.4664922155685,11147584.275085378]
[null,{"$f":"$J$32","v":0.152587890625},{"$f":"$J$35","v":95.217672762582936},97.556835133562615,5.4716805978072731,null,null,null,null,null,null,null,null,null,null,null,null,null,null,null,null,null,null,null,null,null,null,null,{"$f":"$AK$32","v":0.152587890625},{"$f":"$AK$35","v":97.333333333333343},3453.4664922155685,11263629.780148849]
[null,{"$f":"$K$32","v":3.814697265625E-2},{"$f":"$K$35","v":97.212332092571614},97.558392236784869,0.11975762341289833,null,null,null,null,null,null,null,null,null,null,null,null,null,null,null,null,null,null,null,null,null,null,null,{"$f":"$AL$32","v":3.814697265625E-2},{"$f":"$AL$35","v":100},3453.4664922155685,11245737.514412589]
[null,null,null,null,{"$f":"SQRT(AVERAGE(E82:E91))","v":5.3305156356095944},null,null,null,null,null,null,null,null,null,null,null,null,null,null,null,null,null,null,null,null,null,null,null,null,null,null,{"$f":"SQRT(AVERAGE(AF82:AF91))","v":6655.1849781454885}]
[]
[null,"IC50",1376.8981567205064,null,null,null,null,null,null,null,null,null,null,null,null,null,null,null,null,null,null,null,null,null,null,null,null,null,"IC50",772.28869177350384]
[null,"HillSlope",1.7131345334871399E-4,null,null,null,null,null,null,null,null,null,null,null,null,null,null,null,null,null,null,null,null,null,null,null,null,null,"HillSlope",0]
[null,"Top",225.38362422533805,"Min",{"$f":"MIN(D99:D108)","v":112.67267298263364},null,null,null,null,null,null,null,null,null,null,null,null,null,null,null,null,null,null,null,null,null,null,null,"Top",11519.166673610711,"Min",{"$f":"MIN(AE99:AE108)","v":5759.5833368053554}]
[null,"Bottom",0,"50%",{"$f":"(C96+C97)/2","v":112.69181211266903},null,null,null,null,null,null,null,null,null,null,null,null,null,null,null,null,null,null,null,null,null,null,null,"Bottom",0,"50%",{"$f":"(AD96+AD97)/2","v":5759.5833368053554}]
["Kinase 4",null,"Raw","Analysis","Sqare difference",null,null,null,null,null,null,null,null,null,null,null,null,null,null,null,null,null,null,null,null,null,null,"Kinase 4",null,"Raw","Analysis","Sqare difference"]
[null,{"$f":"$B$32","v":10000},{"$f":"$B$36","v":114.71536237379722},{"$f":"$C$97+($C$96-$C$97)/(1+((B99/$C$94)^$C$95))","v":112.67267298263364},{"$f":"(C99-D99)^2","v":4.1725799487722259},null,null,null,null,null,null,null,null,null,null,null,null,null,null,null,null,null,null,null,null,null,null,null,{"$f":"$AC$32","v":10000},{"$f":"$AC$36","v":22738.888888888887},{"$f":"$AD$97+($AD$96-$AD$97)/(1+((AC99/$AD$94)^$AD$95))","v":5759.5833368053554},{"$f":"(AD99-AE99)^2","v":288296817.03101468}]
[null,{"$f":"$C$32","v":2500},{"$f":"$C$36","v":98.921647627624779},{"$f":"$C$97+($C$96-$C$97)/(1+((B100/$C$94)^$C$95))","v":112.68605462095064},{"$f":"(C100-D100)^2","v":189.45889987791793},null,null,null,null,null,null,null,null,null,null,null,null,null,null,null,null,null,null,null,null,null,null,null,{"$f":"$AD$32","v":2500},{"$f":"$AD$36","v":33641.666666666672},{"$f":"$AD$97+($AD$96-$AD$97)/(1+((AC100/$AD$94)^$AD$95))","v":5759.5833368053554},{"$f":"(AD100-AE100)^2","v":777410570.81333017}]
[null,{"$f":"$D$32","v":625},{"$f":"$D$36","v":112.84068824951414},112.69943625943,1.9952124702730868E-2,null,null,null,null,null,null,null,null,null,null,null,null,null,null,null,null,null,null,null,null,null,null,null,{"$f":"$AE$32","v":625},{"$f":"$AE$36","v":208.33333333333334},5759.5833368053554,30816376.601048131]
[null,{"$f":"$E$32","v":156.25},{"$f":"$E$36","v":116.04730530407168},112.71281789769435,11.118806263289045,null,null,null,null,null,null,null,null,null,null,null,null,null,null,null,null,null,null,null,null,null,null,null,{"$f":"$AF$32","v":156.25},{"$f":"$AF$36","v":172.22222222222223},5759.5833368053554,31218604.224755667]
[null,{"$f":"$F$32","v":39.0625},{"$f":"$F$36","v":119.1923022230649},112.72619953536631,41.810483967862986,null,null,null,null,null,null,null,null,null,null,null,null,null,null,null,null,null,null,null,null,null,null,null,{"$f":"$AG$32","v":39.0625},{"$f":"$AG$36","v":133.33333333333331},5759.5833368053554,31654689.101568934]
[null,{"$f":"$G$32","v":9.765625},{"$f":"$G$36","v":117.1920178224392},112.73958117206853,19.824192125564007,null,null,null,null,null,null,null,null,null,null,null,null,null,null,null,null,null,null,null,null,null,null,null,{"$f":"$AH$32","v":9.765625},{"$f":"$AH$36","v":133.33333333333331},5759.5833368053554,31654689.101568934]
[null,{"$f":"$H$32","v":2.44140625},{"$f":"$H$36","v":118.60217092477603},112.75296280742359,34.213235600101754,null,null,null,null,null,null,null,null,null,null,null,null,null,null,null,null,null,null,null,null,null,null,null,{"$f":"$AI$32","v":2.44140625},{"$f":"$AI$36","v":161.11111111111111},5759.5833368053554,31342891.261869863]
[null,{"$f":"$I$32","v":0.6103515625},{"$f":"$I$36","v":114.670332274731},112.76634444105416,3.6251696707894139,null,null,null,null,null,null,null,null,null,null,null,null,null,null,null,null,null,null,null,null,null,null,null,{"$f":"$AJ$32","v":0.6103515625},{"$f":"$AJ$36","v":137.5},5759.5833368053554,31607821.04598444]
[null,{"$f":"$J$32","v":0.152587890625},{"$f":"$J$36","v":112.01592643503815},112.77972607258285,0.5833898863134046,null,null,null,null,null,null,null,null,null,null,null,null,null,null,null,null,null,null,null,null,null,null,null,{"$f":"$AK$32","v":0.152587890625},{"$f":"$AK$36","v":143.05555555555557},5759.5833368053554,31545384.317550797]
[null,{"$f":"$K$32","v":3.814697265625E-2},{"$f":"$K$36","v":103.13077688770915},112.79310770163227,93.360636757688226,null,null,null,null,null,null,null,null,null,null,null,null,null,null,null,null,null,null,null,null,null,null,null,{"$f":"$AL$32","v":3.814697265625E-2},{"$f":"$AL$36","v":126.38888888888889},5759.5833368053554,31732879.688036907]
[null,null,null,null,{"$f":"SQRT(AVERAGE(E99:E108))","v":6.3102087621805492},null,null,null,null,null,null,null,null,null,null,null,null,null,null,null,null,null,null,null,null,null,null,null,null,null,null,{"$f":"SQRT(AVERAGE(AF99:AF108))","v":11477.285058700638}]
[]
[null,"IC50",1647.2008520692336,null,null,null,null,null,null,null,null,null,null,null,null,null,null,null,null,null,null,null,null,null,null,null,null,null,"IC50",805.1699829490201]
[null,"HillSlope",0,null,null,null,null,null,null,null,null,null,null,null,null,null,null,null,null,null,null,null,null,null,null,null,null,null,"HillSlope",0]
[null,"Top",219.75207283368024,"Min",{"$f":"MIN(D116:D125)","v":109.87603641684012},null,null,null,null,null,null,null,null,null,null,null,null,null,null,null,null,null,null,null,null,null,null,null,"Top",6695.9302326189945,"Min",{"$f":"MIN(AE116:AE125)","v":3347.9651163119956}]
[null,"Bottom",0,"50%",{"$f":"(C113+C114)/2","v":109.87603641684012},null,null,null,null,null,null,null,null,null,null,null,null,null,null,null,null,null,null,null,null,null,null,null,"Bottom",4.9961063165077553E-9,"50%",{"$f":"(AD113+AD114)/2","v":3347.9651163119952}]
["Kinase 5",null,"Raw","Analysis","Sqare difference",null,null,null,null,null,null,null,null,null,null,null,null,null,null,null,null,null,null,null,null,null,null,"Kinase 5",null,"Raw","Analysis","Sqare difference"]
[null,{"$f":"$B$32","v":10000},{"$f":"$B$37","v":102.70078036091692},{"$f":"$C$114+($C$113-$C$114)/(1+((B116/$C$111)^$C$112))","v":109.87603641684012},{"$f":"(C116-D116)^2","v":51.484299468062545},null,null,null,null,null,null,null,null,null,null,null,null,null,null,null,null,null,null,null,null,null,null,null,{"$f":"$AC$32","v":10000},{"$f":"$AC$37","v":3420.9302325581398},{"$f":"$AD$114+($AD$113-$AD$114)/(1+((AC116/$AD$111)^$AD$112))","v":3347.9651163119956},{"$f":"(AD116-AE116)^2","v":5323.9081888133269}]
[null,{"$f":"$C$32","v":2500},{"$f":"$C$37","v":100},{"$f":"$C$114+($C$113-$C$114)/(1+((B117/$C$111)^$C$112))","v":109.87603641684012},{"$f":"(C117-D117)^2","v":97.536095306752287},null,null,null,null,null,null,null,null,null,null,null,null,null,null,null,null,null,null,null,null,null,null,null,{"$f":"$AD$32","v":2500},{"$f":"$AD$37","v":29105.232558139534},{"$f":"$AD$114+($AD$113-$AD$114)/(1+((AC117/$AD$111)^$AD$112))","v":3347.9651163119956},{"$f":"(AD117-AE117)^2","v":663436826.06982899}]
[null,{"$f":"$D$32","v":625},{"$f":"$D$37","v":116.08071858234435},109.87603641684012,38.49808077492618,null,null,null,null,null,null,null,null,null,null,null,null,null,null,null,null,null,null,null,null,null,null,null,{"$f":"$AE$32","v":625},{"$f":"$AE$37","v":176.74418604651163},3347.9651163119956,10056642.188553883]
[null,{"$f":"$E$32","v":156.25},{"$f":"$E$37","v":121.61030726711104},109.87603641684012,137.69311238751774,null,null,null,null,null,null,null,null,null,null,null,null,null,null,null,null,null,null,null,null,null,null,null,{"$f":"$AF$32","v":156.25},{"$f":"$AF$37","v":146.51162790697674},3347.9651163119956,10249304.438420665]
[null,{"$f":"$F$32","v":39.0625},{"$f":"$F$37","v":117.10494228580718},109.87603641684012,52.257080062386422,null,null,null,null,null,null,null,null,null,null,null,null,null,null,null,null,null,null,null,null,null,null,null,{"$f":"$AG$32","v":39.0625},{"$f":"$AG$37","v":125.58139534883721},3347.9651163119956,10383756.84512837]
[null,{"$f":"$G$32","v":9.765625},{"$f":"$G$37","v":113.69289546415217},109.87603641684012,14.568412987047852,null,null,null,null,null,null,null,null,null,null,null,null,null,null,null,null,null,null,null,null,null,null,null,{"$f":"$AH$32","v":9.765625},{"$f":"$AH$37","v":115.11627906976744},3347.9651163119956,10451311.604458425]
[null,{"$f":"$H$32","v":2.44140625},{"$f":"$H$37","v":112.07527231344497},109.87603641684012,4.8366385289153255,null,null,null,null,null,null,null,null,null,null,null,null,null,null,null,null,null,null,null,null,null,null,null,{"$f":"$AI$32","v":2.44140625},{"$f":"$AI$37","v":104.65116279069768},3347.9651163119956,10519085.401105953]
[null,{"$f":"$I$32","v":0.6103515625},{"$f":"$I$37","v":105.73483986343683},109.87603641684012,17.14950889391929,null,null,null,null,null,null,null,null,null,null,null,null,null,null,null,null,null,null,null,null,null,null,null,{"$f":"$AJ$32","v":0.6103515625},{"$f":"$AJ$37","v":101.16279069767442},3347.9651163119956,10541725.341614563]
[null,{"$f":"$J$32","v":0.152587890625},{"$f":"$J$37","v":103.95870590147945},109.87603641684012,35.014800428018631,null,null,null,null,null,null,null,null,null,null,null,null,null,null,null,null,null,null,null,null,null,null,null,{"$f":"$AK$32","v":0.152587890625},{"$f":"$AK$37","v":88.372093023255815},3347.9651163119956,10624946.677472629]
[null,{"$f":"$K$32","v":3.814697265625E-2},{"$f":"$K$37","v":105.801902129735},109.87603641684012,16.598570189365581,null,null,null,null,null,null,null,null,null,null,null,null,null,null,null,null,null,null,null,null,null,null,null,{"$f":"$AL$32","v":3.814697265625E-2},{"$f":"$AL$37","v":95.348837209302332},3347.9651163119956,10579512.659083849]
[null,null,null,null,{"$f":"SQRT(AVERAGE(E116:E125))","v":6.8237570225419946},null,null,null,null,null,null,null,null,null,null,null,null,null,null,null,null,null,null,null,null,null,null,null,null,null,null,{"$f":"SQRT(AVERAGE(AF116:AF125))","v":8642.0393145012731}]
[]
[null,"IC50",1416.7472613793443,null,null,null,null,null,null,null,null,null,null,null,null,null,null,null,null,null,null,null,null,null,null,null,null,null,"IC50",765.2332159208031]
[null,"HillSlope",1.5373861579454248E-2,null,null,null,null,null,null,null,null,null,null,null,null,null,null,null,null,null,null,null,null,null,null,null,null,null,"HillSlope",0]
[null,"Top",201.75989586073456,"Min",{"$f":"MIN(D133:D142)","v":99.364646812391499},null,null,null,null,null,null,null,null,null,null,null,null,null,null,null,null,null,null,null,null,null,null,null,"Top",6439.8913042924778,"Min",{"$f":"MIN(AE133:AE142)","v":3219.9456521505053}]
[null,"Bottom",0,"50%",{"$f":"(C130+C131)/2","v":100.87994793036728},null,null,null,null,null,null,null,null,null,null,null,null,null,null,null,null,null,null,null,null,null,null,null,"Bottom",8.5323517061162838E-9,"50%",{"$f":"(AD130+AD131)/2","v":3219.9456521505049}]
["Kinase 6",null,"Raw","Analysis","Sqare difference",null,null,null,null,null,null,null,null,null,null,null,null,null,null,null,null,null,null,null,null,null,null,"Kinase 6",null,"Raw","Analysis","Sqare difference"]
[null,{"$f":"$B$32","v":10000},{"$f":"$B$38","v":94.374031826503312},{"$f":"$C$131+($C$130-$C$131)/(1+((B133/$C$128)^$C$129))","v":99.364646812391499},{"$f":"(C133-D133)^2","v":24.906237937371738},null,null,null,null,null,null,null,null,null,null,null,null,null,null,null,null,null,null,null,null,null,null,null,{"$f":"$AC$32","v":10000},{"$f":"$AC$38","v":14627.173913043478},{"$f":"$AD$131+($AD$130-$AD$131)/(1+((AC133/$AD$128)^$AD$129))","v":3219.9456521505053},{"$f":"(AD133-AE133)^2","v":130124856.59611532}]
[null,{"$f":"$C$32","v":2500},{"$f":"$C$38","v":91.455428812843266},{"$f":"$C$131+($C$130-$C$131)/(1+((B134/$C$128)^$C$129))","v":100.4395475441287},{"$f":"(C134-D134)^2","v":80.714389377833811},null,null,null,null,null,null,null,null,null,null,null,null,null,null,null,null,null,null,null,null,null,null,null,{"$f":"$AD$32","v":2500},{"$f":"$AD$38","v":16502.717391304348},{"$f":"$AD$131+($AD$130-$AD$131)/(1+((AC134/$AD$128)^$AD$129))","v":3219.9456521505053},{"$f":"(AD134-AE134)^2","v":176432025.07446399}]
[null,{"$f":"$D$32","v":625},{"$f":"$D$38","v":105.4781016758203},101.51454828815979,15.709755456835111,null,null,null,null,null,null,null,null,null,null,null,null,null,null,null,null,null,null,null,null,null,null,null,{"$f":"$AE$32","v":625},{"$f":"$AE$38","v":166.30434782608697},3219.9456521505053,9324725.2154761348]
[null,{"$f":"$E$32","v":156.25},{"$f":"$E$38","v":112.75876637093367},102.5894049212009,103.4159122953111,null,null,null,null,null,null,null,null,null,null,null,null,null,null,null,null,null,null,null,null,null,null,null,{"$f":"$AF$32","v":156.25},{"$f":"$AF$38","v":150},3219.9456521505053,9424566.3071577922]
[null,{"$f":"$F$32","v":39.0625},{"$f":"$F$38","v":108.36149838050979},103.66387345084762,22.067679979783495,null,null,null,null,null,null,null,null,null,null,null,null,null,null,null,null,null,null,null,null,null,null,null,{"$f":"$AG$32","v":39.0625},{"$f":"$AG$38","v":127.17391304347827},3219.9456521505053,9565237.0302191041]
[null,{"$f":"$G$32","v":9.765625},{"$f":"$G$38","v":107.33347415856922},104.73771023703421,6.7379903363428131,null,null,null,null,null,null,null,null,null,null,null,null,null,null,null,null,null,null,null,null,null,null,null,{"$f":"$AH$32","v":9.765625},{"$f":"$AH$38","v":128.26086956521738},3219.9456521505053,9558514.7948694378]
[null,{"$f":"$H$32","v":2.44140625},{"$f":"$H$38","v":106.97436980706942},105.81067221281363,1.3541920908767222,null,null,null,null,null,null,null,null,null,null,null,null,null,null,null,null,null,null,null,null,null,null,null,{"$f":"$AI$32","v":2.44140625},{"$f":"$AI$38","v":113.04347826086956},3219.9456521505053,9652841.1181201451]
[null,{"$f":"$I$32","v":0.6103515625},{"$f":"$I$38","v":104.74228981833545},106.88251710403323,4.5805728344452694,null,null,null,null,null,null,null,null,null,null,null,null,null,null,null,null,null,null,null,null,null,null,null,{"$f":"$AJ$32","v":0.6103515625},{"$f":"$AJ$38","v":121.73913043478262},3219.9456521505053,9598883.6512018386]
[null,{"$f":"$J$32","v":0.152587890625},{"$f":"$J$38","v":103.14744402196874},107.95300364748537,23.093403314395594,null,null,null,null,null,null,null,null,null,null,null,null,null,null,null,null,null,null,null,null,null,null,null,{"$f":"$AK$32","v":0.152587890625},{"$f":"$AK$38","v":135.86956521739131},3219.9456521505053,9511525.3099926673]
[null,{"$f":"$K$32","v":3.814697265625E-2},{"$f":"$K$38","v":107.35459794395155},109.02189180711686,2.7798688261487117,null,null,null,null,null,null,null,null,null,null,null,null,null,null,null,null,null,null,null,null,null,null,null,{"$f":"$AL$32","v":3.814697265625E-2},{"$f":"$AL$38","v":127.17391304347827},3219.9456521505053,9565237.0302191041]
[null,null,null,null,{"$f":"SQRT(AVERAGE(E133:E142))","v":5.3419097937848443},null,null,null,null,null,null,null,null,null,null,null,null,null,null,null,null,null,null,null,null,null,null,null,null,null,null,{"$f":"SQRT(SUM(AF133:AF142))","v":19564.212535336952}]
[]
[null,"IC50",1156.7910458578847,null,null,null,null,null,null,null,null,null,null,null,null,null,null,null,null,null,null,null,null,null,null,null,null,null,"IC50",762.57383297452839]
[null,"HillSlope",1.4131119636842982E-2,null,null,null,null,null,null,null,null,null,null,null,null,null,null,null,null,null,null,null,null,null,null,null,null,null,"HillSlope",0]
[null,"Top",177.19027136729218,"Min",{"$f":"MIN(D150:D159)","v":87.245054312728129},null,null,null,null,null,null,null,null,null,null,null,null,null,null,null,null,null,null,null,null,null,null,null,"Top",9739.1390665060953,"Min",{"$f":"MIN(AE150:AE159)","v":4869.5695332530477}]
[null,"Bottom",0,"50%",{"$f":"(C147+C148)/2","v":88.595135683646092},null,null,null,null,null,null,null,null,null,null,null,null,null,null,null,null,null,null,null,null,null,null,null,"Bottom",0,"50%",{"$f":"(AD147+AD148)/2","v":4869.5695332530477}]
["Kinase 7",null,"Raw","Analysis","Sqare difference",null,null,null,null,null,null,null,null,null,null,null,null,null,null,null,null,null,null,null,null,null,null,"Kinase 7",null,"Raw","Analysis","Sqare difference"]
[null,{"$f":"$B$32","v":10000},{"$f":"$B$39","v":87.995094228052693},{"$f":"$C$148+($C$147-$C$148)/(1+((B150/$C$145)^$C$146))","v":87.245054312728129},{"$f":"(C150-D150)^2","v":0.56255987458007883},null,null,null,null,null,null,null,null,null,null,null,null,null,null,null,null,null,null,null,null,null,null,null,{"$f":"$AC$32","v":10000},{"$f":"$AC$39","v":22622.185430463578},{"$f":"$AD$148+($AD$147-$AD$148)/(1+((AC150/$AD$145)^$AD$146))","v":4869.5695332530477},{"$f":"(AD150-AE150)^2","v":315155371.193892}]
[null,{"$f":"$C$32","v":2500},{"$f":"$C$39","v":75.647441442822569},{"$f":"$C$148+($C$147-$C$148)/(1+((B151/$C$145)^$C$146))","v":88.11273910647418},{"$f":"(C151-D151)^2","v":155.38364584343833},null,null,null,null,null,null,null,null,null,null,null,null,null,null,null,null,null,null,null,null,null,null,null,{"$f":"$AD$32","v":2500},{"$f":"$AD$39","v":25117.218543046358},{"$f":"$AD$148+($AD$147-$AD$148)/(1+((AC151/$AD$145)^$AD$146))","v":4869.5695332530477},{"$f":"(AD151-AE151)^2","v":409967290.42378396}]
[null,{"$f":"$D$32","v":625},{"$f":"$D$39","v":93.444005212382692},88.980516454739615,19.92273188960614,null,null,null,null,null,null,null,null,null,null,null,null,null,null,null,null,null,null,null,null,null,null,null,{"$f":"$AE$32","v":625},{"$f":"$AE$39","v":154.30463576158942},4869.5695332530477,22233723.053515133]
[null,{"$f":"$E$32","v":156.25},{"$f":"$E$39","v":98.00812518478773},89.848219861529742,66.584054884534041,null,null,null,null,null,null,null,null,null,null,null,null,null,null,null,null,null,null,null,null,null,null,null,{"$f":"$AF$32","v":156.25},{"$f":"$AF$39","v":139.73509933774835},4869.5695332530477,22371333.772250857]
[null,{"$f":"$F$32","v":39.0625},{"$f":"$F$39","v":96.351332114190598},90.715682887588542,31.760542205300343,null,null,null,null,null,null,null,null,null,null,null,null,null,null,null,null,null,null,null,null,null,null,null,{"$f":"$AG$32","v":39.0625},{"$f":"$AG$39","v":121.19205298013244},4869.5695332530477,22547088.695162956]
[null,{"$f":"$G$32","v":9.765625},{"$f":"$G$39","v":93.955388136354173},91.58273927806529,5.6294626047395422,null,null,null,null,null,null,null,null,null,null,null,null,null,null,null,null,null,null,null,null,null,null,null,{"$f":"$AH$32","v":9.765625},{"$f":"$AH$39","v":120.52980132450331},4869.5695332530477,22553378.375435937]
[null,{"$f":"$H$32","v":2.44140625},{"$f":"$H$39","v":86.54745348824477},92.449223089880306,34.830884430789268,null,null,null,null,null,null,null,null,null,null,null,null,null,null,null,null,null,null,null,null,null,null,null,{"$f":"$AI$32","v":2.44140625},{"$f":"$AI$39","v":98.675496688741731},4869.5695332530477,22761429.908124853]
[null,{"$f":"$I$32","v":0.6103515625},{"$f":"$I$39","v":92.460660746159149},93.31496881858331,0.72984228260908468,null,null,null,null,null,null,null,null,null,null,null,null,null,null,null,null,null,null,null,null,null,null,null,{"$f":"$AJ$32","v":0.6103515625},{"$f":"$AJ$39","v":94.701986754966882},4869.5695332530477,22799360.086600602]
[null,{"$f":"$J$32","v":0.152587890625},{"$f":"$J$39","v":88.74738559586514},94.179811524498291,29.511251470085753,null,null,null,null,null,null,null,null,null,null,null,null,null,null,null,null,null,null,null,null,null,null,null,{"$f":"$AK$32","v":0.152587890625},{"$f":"$AK$39","v":109.27152317880795},4869.5695332530477,22660437.144716766]
[null,{"$f":"$K$32","v":3.814697265625E-2},{"$f":"$K$39","v":98.315830969875492},95.043586957951007,10.707580873575649,null,null,null,null,null,null,null,null,null,null,null,null,null,null,null,null,null,null,null,null,null,null,null,{"$f":"$AL$32","v":3.814697265625E-2},{"$f":"$AL$39","v":117.88079470198676},4869.5695332530477,22578545.868072972]
[null,null,null,null,{"$f":"SQRT(AVERAGE(E150:E159))","v":5.9634097323532806},null,null,null,null,null,null,null,null,null,null,null,null,null,null,null,null,null,null,null,null,null,null,null,null,null,null,{"$f":"SQRT(AVERAGE(AF150:AF159))","v":9516.4486996019477}]
[]
[null,"IC50",1198.7264330353514,null,null,null,null,null,null,null,null,null,null,null,null,null,null,null,null,null,null,null,null,null,null,null,null,null,"IC50",767.91953032990489]
[null,"HillSlope",5.2670427105962702E-4,null,null,null,null,null,null,null,null,null,null,null,null,null,null,null,null,null,null,null,null,null,null,null,null,null,"HillSlope",0]
[null,"Top",183.60366651002951,"Min",{"$f":"MIN(D167:D176)","v":91.750547654341304},null,null,null,null,null,null,null,null,null,null,null,null,null,null,null,null,null,null,null,null,null,null,null,"Top",17501.01961570184,"Min",{"$f":"MIN(AE167:AE176)","v":8750.50980785092}]
[null,"Bottom",0,"50%",{"$f":"(C164+C165)/2","v":91.801833255014756},null,null,null,null,null,null,null,null,null,null,null,null,null,null,null,null,null,null,null,null,null,null,null,"Bottom",0,"50%",{"$f":"(AD164+AD165)/2","v":8750.50980785092}]
["Kinase 8",null,"Raw","Analysis","Sqare difference",null,null,null,null,null,null,null,null,null,null,null,null,null,null,null,null,null,null,null,null,null,null,"Kinase 8",null,"Raw","Analysis","Sqare difference"]
[null,{"$f":"$B$32","v":10000},{"$f":"$B$40","v":93.466747523751764},{"$f":"$C$165+($C$164-$C$165)/(1+((B167/$C$162)^$C$163))","v":91.750547654341304},{"$f":"(C167-D167)^2","v":2.945341991764479},null,null,null,null,null,null,null,null,null,null,null,null,null,null,null,null,null,null,null,null,null,null,null,{"$f":"$AC$32","v":10000},{"$f":"$AC$40","v":37267.34693877551},{"$f":"$AD$165+($AD$164-$AD$165)/(1+((AC167/$AD$162)^$AD$163))","v":8750.50980785092},{"$f":"(AD167-AE167)^2","v":813209999.95167947}]
[null,{"$f":"$C$32","v":2500},{"$f":"$C$40","v":83.038204972710744},{"$f":"$C$165+($C$164-$C$165)/(1+((B168/$C$162)^$C$163))","v":91.78406299120671},{"$f":"(C168-D168)^2","v":76.490032479690186},null,null,null,null,null,null,null,null,null,null,null,null,null,null,null,null,null,null,null,null,null,null,null,{"$f":"$AD$32","v":2500},{"$f":"$AD$40","v":49078.571428571428},{"$f":"$AD$165+($AD$164-$AD$165)/(1+((AC168/$AD$162)^$AD$163))","v":8750.50980785092},{"$f":"(AD168-AE168)^2","v":1626352554.0846305}]
[null,{"$f":"$D$32","v":625},{"$f":"$D$40","v":93.994340004042854},91.817578332809191,4.7382913733519709,null,null,null,null,null,null,null,null,null,null,null,null,null,null,null,null,null,null,null,null,null,null,null,{"$f":"$AE$32","v":625},{"$f":"$AE$40","v":261.22448979591837},8750.50980785092,72067965.211344197]
[null,{"$f":"$E$32","v":156.25},{"$f":"$E$40","v":98.55670103092784},91.851093670214453,44.965170076053553,null,null,null,null,null,null,null,null,null,null,null,null,null,null,null,null,null,null,null,null,null,null,null,{"$f":"$AF$32","v":156.25},{"$f":"$AF$40","v":173.46938775510205},8750.50980785092,73565622.367957458]
[null,{"$f":"$F$32","v":39.0625},{"$f":"$F$40","v":100.68526379624015},91.884608994488289,77.451524939598087,null,null,null,null,null,null,null,null,null,null,null,null,null,null,null,null,null,null,null,null,null,null,null,{"$f":"$AG$32","v":39.0625},{"$f":"$AG$40","v":138.77551020408163},8750.50980785092,74161967.6132669]
[null,{"$f":"$G$32","v":9.765625},{"$f":"$G$40","v":82.567212451991097},91.918124296696433,87.439552327450571,null,null,null,null,null,null,null,null,null,null,null,null,null,null,null,null,null,null,null,null,null,null,null,{"$f":"$AH$32","v":9.765625},{"$f":"$AH$40","v":122.44897959183673},8750.50980785092,74443433.656138822]
[null,{"$f":"$H$32","v":2.44140625},{"$f":"$H$40","v":91.113806347281184},91.951639567904706,0.7019645055803847,null,null,null,null,null,null,null,null,null,null,null,null,null,null,null,null,null,null,null,null,null,null,null,{"$f":"$AI$32","v":2.44140625},{"$f":"$AI$40","v":124.48979591836735},8750.50980785092,74408221.246260881]
[null,{"$f":"$I$32","v":0.6103515625},{"$f":"$I$40","v":91.853648675965232},91.985154799178886,1.7293860442684824E-2,null,null,null,null,null,null,null,null,null,null,null,null,null,null,null,null,null,null,null,null,null,null,null,{"$f":"$AJ$32","v":0.6103515625},{"$f":"$AJ$40","v":124.48979591836735},8750.50980785092,74408221.246260881]
[null,{"$f":"$J$32","v":0.152587890625},{"$f":"$J$40","v":87.244794825146556},92.018669981584878,22.789884009259016,null,null,null,null,null,null,null,null,null,null,null,null,null,null,null,null,null,null,null,null,null,null,null,{"$f":"$AK$32","v":0.152587890625},{"$f":"$AK$40","v":118.36734693877551},8750.50980785092,74513883.465482369]
[null,{"$f":"$K$32","v":3.814697265625E-2},{"$f":"$K$40","v":96.492823933697196},92.052185106188603,19.719273196376893,null,null,null,null,null,null,null,null,null,null,null,null,null,null,null,null,null,null,null,null,null,null,null,{"$f":"$AL$32","v":3.814697265625E-2},{"$f":"$AL$40","v":95.918367346938766},8750.50980785092,74901953.002044797]
[null,null,null,null,{"$f":"SQRT(AVERAGE(E167:E176))","v":5.8073946719640803},null,null,null,null,null,null,null,null,null,null,null,null,null,null,null,null,null,null,null,null,null,null,null,null,null,null,{"$f":"SQRT(AVERAGE(AF167:AF176))","v":17412.736206136778}]

{"sheet":"Kinase Strips","index":3,"n_rows":142,"n_cols":4,"rows_kept":142,"cut":false,"hidden":true,"merged":[[94,0,117,0],[94,1,101,1],[102,1,109,1],[110,1,117,1],[6,1,13,1],[14,1,21,1],[22,1,29,1],[30,1,37,1],[38,1,45,1],[46,1,53,1],[118,1,125,1],[126,1,133,1],[134,1,141,1],[54,1,61,1],[62,1,69,1],[70,1,77,1],[78,1,85,1],[86,1,93,1]]}
[]
[]
["Strip Composition:"]
[]
[]
[null,"Strip Name","Tube in Strip","Kinase"]
[null,"TK-1",1,"EGFR"]
[null,null,2,"HER2"]
[null,null,3,"HER4"]
[null,null,4,"IGF1R"]
[null,null,5,"InsR"]
[null,null,6,"KDR"]
[null,null,7,"PDGFRa"]
[null,null,8,"PDGFRb"]
[null,"TK-2",1,"ABL1"]
[null,null,2,"BRK"]
[null,null,3,"BTK"]
[null,null,4,"CSK"]
[null,null,5,"FYN A"]
[null,null,6,"LCK"]
[null,null,7,"LYN B"]
[null,null,8,"SRC"]
[null,"TK-3",1,"AXL1"]
[null,null,2,"EPHA1"]
[null,null,3,"FAK"]
[null,null,4,"ITK"]
[null,null,5,"JAK3"]
[null,null,6,"PYK2"]
[null,null,7,"SYK"]
[null,null,8,"TRKA"]
[null,"CMGC-1",1,"ERK2"]
[null,null,2,"GSK3b"]
[null,null,3,"JNK1"]
[null,null,4,"JNK3"]
[null,null,5,"p38a"]
[null,null,6,"p38b"]
[null,null,7,"p38d"]
[null,null,8,"p38g"]
[null,"CMGC-2",1,"CDK1/CyclinA2"]
[null,null,2,"CDK2/CyclinE1"]
[null,null,3,"CDK3/CyclinE1"]
[null,null,4,"CDK5/p25"]
[null,null,5,"CDK5/p35"]
[null,null,6,"CDK6/Cyclin D3"]
[null,null,7,"CDK9/Cyclin K"]
[null,null,8,"CLK3"]
[null,"AGC-1",1,"AKT1"]
[null,null,2,"p70S6Kb"]
[null,null,3,"PDK1"]
[null,null,4,"PKA"]
[null,null,5,"PKC"]
[null,null,6,"PRKG1"]
[null,null,7,"ROCK1"]
[null,null,8,"RSK2"]
[null,"AGC-2",1,"PKCa"]
[null,null,2,"PKCb II"]
[null,null,3,"PKCd"]
[null,null,4,"PKCe"]
[null,null,5,"PKCg"]
[null,null,6,"PKCi"]
[null,null,7,"PKCtheta"]
[null,null,8,"PKCz"]
[null,"CAMK-1",1,"CHK1"]
[null,null,2,"CHK2"]
[null,null,3,"MAPKAPK2"]
[null,null,4,"MARK1"]
[null,null,5,"MELK"]
[null,null,6,"PASK"]
[null,null,7,"PIM1"]
[null,null,8,"PKCmu (PKD1)"]
[null,"Other/CK-1",1,"Aurora A"]
[null,null,2,"Aurora B"]
[null,null,3,"CK2a1"]
[null,null,4,"DNA-PK"]
[null,null,5,"CK1α1"]
[null,null,6,"CK1epsilon"]
[null,null,7,"CK1g1"]
[null,null,8,"VRK2"]
[null,"TKL-1",1,"ALK2"]
[null,null,2,"ALK4"]
[null,null,3,"IRAK4"]
[null,null,4,"MLK2"]
[null,null,5,"RIPK2"]
[null,null,6,"TAK1-TAB1"]
[null,null,7,"TGFβR2"]
[null,null,8,"ZAK"]
[null,"STE-1",1,"ASK1"]
[null,null,2,"HPK1"]
[null,null,3,"MINK1"]
[null,null,4,"MST1"]
[null,null,5,"NIK"]
[null,null,6,"PAK1/CDC42 "]
[null,null,7,"PAK3"]
[null,null,8,"TNIK"]
["Second Launch - Still not complete","CAMK-2",1,"AMPK A1/B1/G1"]
[null,null,2,"AMPK A1/B1/G2"]
[null,null,3,"AMPK A2/B1/G1"]
[null,null,4,"CAMK2a"]
[null,null,5,"CAMK2g"]
[null,null,6,"CAMK4"]
[null,null,7,"DAPK1"]
[null,null,8,"STK33"]
[null,"TK-4",1,"c-MER"]
[null,null,2,"FGFR1"]
[null,null,3,"FGFR2"]
[null,null,4,"FGFR4"]
[null,null,5,"FLT1"]
[null,null,6,"FMS"]
[null,null,7,"MET"]
[null,null,8,"RET"]
[null,"Other-2",1,"CDC7/DBF4"]
[null,null,2,"EIF2AK2"]
[null,null,3,"IKKb"]
[null,null,4,"NEK2"]
[null,null,5,"NEK3"]
[null,null,6,"PLK1"]
[null,null,7,"TBK1"]
[null,null,8,"ULK1"]
[null,"GP-1",1,"FGFR1"]
[null,null,2,"JAK3"]
[null,null,3,"LCK"]
[null,null,4,"SYK"]
[null,null,5,"MINK1"]
[null,null,6,"PAK1/CDC42 "]
[null,null,7,"IRAK4"]
[null,null,8,"TAK1-TAB1"]
[null,"GP-2",1,"CDK2/CyclinE1"]
[null,null,2,"GSK3b"]
[null,null,3,"p38a"]
[null,null,4,"AMPK A1/B1/G2"]
[null,null,5,"CAMK4"]
[null,null,6,"CHK1"]
[null,null,7,"DAPK1"]
[null,null,8,"MAPKAPK2"]
[null,"GP-3",1,"AKT1"]
[null,null,2,"PKCa"]
[null,null,3,"ROCK1"]
[null,null,4,"Aurora A"]
[null,null,5,"CK2a1"]
[null,null,6,"IKKb"]
[null,null,7,"CK1a1"]
[null,null,8,"CK1g1"]